program: Gaussian 09
title: 000200262
version: EM64L-G09RevD.01
frameworkgroup: C1[X(C18H20ClN3O)]
method: RPBEPBE
basis: SDD
operation: Freq
keyword: #p
keyword: freq=noraman
keyword: PBEPBE/SDD
title: #p freq=noraman PBEPBE/SDD
converged: YES YES NO NO
title: Mulliken charges:
elementType: Cl O N N N C C C C C C C C C C C C C C C C C C H H H H H H H H H H H H H H H H H H H H
charge: -0.067930 -0.260691 -0.215520 -0.098488 -0.091573 0.374604 0.022058 -0.552966 0.104291 0.475454 -0.314774 -0.265655 -0.370624 -0.335801 -0.060868 -0.248534 -0.438859 -0.358035 -0.613071 -0.613261 -0.214573 -0.221252 -0.240886 0.259374 0.226716 0.220622 0.238811 0.277054 0.223334 0.197345 0.259487 0.253827 0.230895 0.251541 0.225597 0.190379 0.223849 0.189350 0.222743 0.228789 0.228398 0.228140 0.230704
chargesum: 0.00000
title: Mulliken charges with hydrogens summed into heavy atoms:
elementType: Cl O N N N C C C C C C C C C C C C C C C C C C
charge: -0.067930 -0.260691 -0.215520 -0.098488 -0.091573 0.374604 0.022058 -0.066876 0.104291 0.475454 -0.037721 0.193778 0.050055 -0.076314 -0.060868 0.005293 -0.207964 -0.106494 0.026754 0.027621 0.013824 0.006888 -0.010182
polarizability: 3.02919672e+02 -3.76084025e+00 2.25417690e+02 4.36857620e+00 7.84777084e+00 1.61525065e+02
1716.lowfreq: -4.0078 -2.7987 -0.0018 -0.0017 -0.0015 5.2011 11.0250 21.9495 25.1943
frequency: 10.7464 21.8615 25.1707 26.8280 39.8276 46.7558 77.1965 96.5159 124.8690 132.8330 147.8430 166.8704 192.2396 212.8901 214.4654 234.6650 240.2123 274.8282 291.6323 301.7896 331.0019 348.3812 383.6393 387.9518 403.8790 425.6012 435.5628 448.5352 462.7385 543.6716 562.9424 584.0455 600.0569 615.7915 627.6780 662.0620 693.0571 707.7595 737.2138 750.4575 771.4874 799.0193 804.5248 808.7942 817.5270 844.5834 845.9179 855.7609 907.4033 930.8071 950.3764 954.2359 979.4489 989.8479 998.9188 1025.6857 1028.8169 1034.2168 1036.9588 1051.5352 1063.3508 1074.3353 1088.6874 1091.4107 1096.5645 1139.3392 1143.2962 1168.0768 1172.4164 1173.6042 1186.2851 1206.2143 1238.8470 1245.4711 1267.3669 1283.3702 1289.0812 1311.2662 1319.0348 1329.0283 1347.1670 1374.0012 1384.1331 1389.6094 1403.5090 1419.3700 1427.9650 1443.6171 1444.5248 1453.9582 1460.7642 1466.8689 1470.2674 1474.3449 1476.2953 1483.9391 1484.5617 1486.9119 1512.6632 1575.8020 1597.3593 1615.2133 1623.3418 2851.4186 2860.5166 2882.5193 2989.3627 3003.5293 3020.8440 3029.4789 3043.3832 3060.5617 3075.8445 3080.9268 3087.0459 3112.4421 3125.0177 3136.2413 3147.7831 3158.8989 3164.6147 3179.1188 3182.1511
redmass: 5.1424 2.6160 5.7900 3.8955 5.2449 4.9288 4.4222 1.9481 5.2550 5.0013 4.6717 3.3983 3.7273 1.2292 3.6252 3.4529 1.5019 6.4735 4.1011 2.6020 4.4642 2.9505 4.3342 7.0545 2.8183 2.9363 2.5267 2.9646 3.4136 5.6579 5.3262 5.9924 6.2278 6.1573 5.6997 6.8463 5.3956 1.8393 4.2078 2.0078 6.4713 3.7175 1.3147 1.4663 3.3155 1.8019 2.9360 1.2508 1.5295 6.2186 2.4486 1.3300 1.3901 6.2586 1.3292 2.2507 3.0845 1.6188 2.2115 2.5934 1.5987 2.2735 1.4393 1.8114 2.2337 1.4508 1.3571 1.4387 1.7355 1.5768 1.1145 2.8189 1.7242 1.3515 2.5550 1.5622 1.2442 1.6433 1.6926 2.0780 1.5302 2.5686 2.2231 3.7168 3.7403 1.2216 3.5691 1.1664 2.1029 1.3806 1.0522 1.0679 1.9083 1.3895 1.0626 1.0870 2.1097 1.0785 5.7031 8.3483 6.1467 6.0549 8.2915 1.0569 1.0591 1.0680 1.0641 1.0578 1.0730 1.0724 1.0896 1.0974 1.1059 1.1018 1.1010 1.0881 1.0860 1.0910 1.0961 1.0887 1.1015 1.0940 1.0968
irintensity: 0.0118 0.4887 0.4732 0.0243 0.0339 0.2966 0.1550 1.4375 4.6302 1.4348 1.7040 0.6859 0.5570 1.3018 2.5770 1.0362 0.5101 0.5685 4.5328 3.9765 5.0189 12.8533 3.2683 3.3733 0.2829 8.1321 0.8383 8.2612 6.5666 1.5055 7.1851 2.7833 5.7580 1.4810 10.9883 22.2982 21.8228 84.2269 5.3008 20.3774 8.5148 16.0282 2.4257 40.7631 25.3360 40.0586 33.3770 0.1962 6.9972 58.0000 8.4826 0.2942 0.0249 0.6973 0.9961 7.9836 6.3989 33.0143 72.6005 104.7222 6.3217 18.7033 11.7732 20.1572 2.6459 7.9225 32.6166 18.1652 21.3789 20.4131 2.1866 4.8995 6.7244 17.8303 13.0754 8.9134 6.7296 24.7755 58.9397 10.0378 18.2594 25.9954 51.0881 4.4830 89.4437 12.1263 97.4225 4.0814 21.7674 25.2789 9.5781 5.9074 16.7993 7.2297 10.7387 20.8827 8.1277 23.2561 274.0616 5.4934 1.6320 5.9004 125.0050 70.2537 146.1087 136.3944 35.9983 18.3431 42.8170 49.3571 5.4102 1.8279 12.8880 58.2641 50.9964 9.7798 0.8978 10.2067 34.8517 1.0182 23.6086 1.7655 3.1593
temp: 298.150 k
press: 1.00000 atm
elementType: 17 8 7 7 7 6 6 6 6 6 6 6 6 6 6 6 6 6 6 6 6 6 6 1 1 1 1 1 1 1 1 1 1 1 1 1 1 1 1 1 1 1 1
symmnumber: 1
zpe: 902719.2 jmol-1
zpe.correction: 0.343828 hartree
zpe.thermalcorrener: 0.365927 hartree
zpe.thermalcorrenthalpy: 0.366871 hartree
zpe.thermalcorrgfe: 0.288068 hartree
zpe.sumelectzpe: -1395.736878 hartree
zpe.sumelectthermal: -1395.714779 hartree
zpe.sumelectthermalent: -1395.713835 hartree
zpe.sumelectthermalfe: -1395.792638 hartree
dipole: 1.6233 -1.9510 0.2536
dipole: 2.5506
quadrupole: -127.0012 -142.7232 -138.7782
quadrupole: 11.9468 7.7379 -1.4314
quadrupole: 9.1663 -6.5557 -2.6106 11.9468 7.7379 -1.4314
hfenergy: -1396.0807055 hartree
pointgroup: C01 [X(C18H20Cl1N3O1)]
dipole: -0.647703 -0.7660244 0.0261909 debye
polarizability: 303.1079132|2.9009016|221.8762132|-0.0511543|-16.557331|164.8783016 unknown
InChI: InChI=1S/C18H20ClN3O/c1-21(2)10-11-23-18-16-9-8-15(19)12-17(16)22(20-18)13-14-6-4-3-5-7-14/h3-9,12H,10-11,13H2,1-2H3
charge 0 multiplicity 1
43 atoms
Cl 4.13501 3.459418 -0.95401
O  -2.467314 1.01855 -0.28074
N  0.663937 -0.156324 0.858421
N  -0.741377 -0.297032 0.76271
N  -5.900805 -0.382701 0.222248
C  1.108472 0.980051 0.1991
C  -0.053332 1.62525 -0.349794
C  1.435093 -1.158984 1.595954
C  -1.150726 0.775358 0.039649
C  2.352186 -2.010208 0.717532
C  2.411608 1.514087 0.031061
C  -3.454607 0.037502 0.24377
C  -4.826082 0.527684 -0.235832
C  0.077075 2.832533 -1.078343
C  2.488313 2.709485 -0.694615
C  1.360787 3.380139 -1.250654
C  3.667017 -2.313581 1.145374
C  1.887982 -2.536252 -0.514126
C  -5.988646 -1.626688 -0.570912
C  -7.211186 0.28977 0.332844
C  4.506709 -3.137048 0.359892
C  2.726772 -3.353162 -1.302527
C  4.038232 -3.658618 -0.867085
H  0.681679 -1.79277 2.096187
H  2.028963 -0.662179 2.387689
H  -3.195988 -0.966114 -0.14185
H  -3.402468 0.01289 1.346913
H  3.304864 1.023406 0.42396
H  -5.003309 1.52913 0.195871
H  -4.806705 0.648378 -1.34751
H  -0.802622 3.329311 -1.497697
H  1.507115 4.310267 -1.805785
H  4.037964 -1.905863 2.094725
H  0.873136 -2.297659 -0.853417
H  -6.744505 -2.296254 -0.12346
H  -6.274045 -1.444914 -1.638761
H  -5.023144 -2.16057 -0.562271
H  -7.617409 0.642063 -0.64944
H  -7.947212 -0.407529 0.772205
H  -7.128111 1.163094 1.003406
H  5.523131 -3.363723 0.700721
H  2.360197 -3.752072 -2.255057
H  4.688752 -4.292122 -1.480249
