program: Gaussian 09
title: 000200192
version: EM64L-G09RevD.01
frameworkgroup: C1[X(C17H23NO2)]
method: RPBEPBE
basis: SDD
operation: Freq
keyword: #p
keyword: freq=noraman
keyword: PBEPBE/SDD
title: #p freq=noraman PBEPBE/SDD
converged: YES YES NO NO
title: Mulliken charges:
elementType: O O N C C C C C C C C C C C C C C C C C H H H H H H H H H H H H H H H H H H H H H H H
charge: -0.244747 -0.257364 -0.074901 -0.345236 -0.367545 -0.400008 -0.391835 -0.397499 -0.342883 -0.549638 0.173640 -0.330370 -0.272695 0.496377 -0.357499 -0.394640 -0.361775 -0.369257 0.323425 -0.536577 0.166306 0.205451 0.215433 0.166485 0.189632 0.202924 0.203184 0.190759 0.211927 0.188502 0.187978 0.237775 0.230567 0.250320 0.216974 0.267957 0.232838 0.237417 0.253499 0.244397 0.225593 0.225760 0.249345
chargesum: 0.00000
title: Mulliken charges with hydrogens summed into heavy atoms:
elementType: O O N C C C C C C C C C C C C C C C C C
charge: -0.244747 -0.257364 -0.074901 0.026522 0.014373 -0.007452 0.002108 0.002931 0.082869 -0.068750 0.173640 -0.113396 -0.004738 0.496377 -0.124660 -0.157223 -0.108276 -0.124860 0.323425 0.164121
polarizability: 3.91976186e+02 1.55820266e+01 1.83558659e+02 2.51609072e+00 2.50531600e+00 1.17462941e+02
1716.lowfreq: -4.4313 -0.0013 -0.0003 0.0007 5.6201 11.4020 22.5254 31.4381 32.6939
frequency: 21.3228 27.0133 32.5771 47.8438 60.4739 81.6588 90.6462 112.9917 148.5508 155.1217 161.4188 194.1006 210.6473 235.0706 244.0927 249.8998 269.0811 302.4854 372.4559 375.1581 395.3037 420.0360 433.6640 443.0088 450.5561 488.8356 507.8628 537.9874 551.1251 559.6058 632.2941 665.9104 732.1353 739.1508 766.2596 785.7796 806.1634 814.4048 833.4339 838.1672 853.4174 856.7248 876.8637 907.4135 931.7547 948.3839 958.8274 969.6004 983.2495 989.9516 998.7066 1011.0160 1030.8751 1043.0739 1056.3778 1079.0216 1108.4829 1112.6761 1114.0005 1118.3807 1126.2456 1151.9006 1156.7616 1157.6890 1168.0250 1181.0176 1215.7691 1223.3038 1243.8865 1258.0801 1264.8742 1279.9234 1284.5917 1295.1305 1295.8416 1317.4466 1325.2264 1330.2097 1340.2994 1345.8373 1349.0034 1371.1064 1382.1859 1394.1060 1433.3566 1434.0095 1437.0745 1452.1315 1460.8215 1462.0687 1466.7934 1467.9381 1470.5572 1471.9153 1481.3208 1502.2916 1552.8418 1569.2390 1620.1537 1641.5111 2810.0791 2822.8655 2864.7062 2963.4532 2966.0692 2966.2132 2983.5316 2983.9793 3012.2169 3022.3757 3028.0372 3034.2164 3043.8355 3048.9334 3053.1704 3056.8572 3088.9648 3116.5504 3130.0585 3131.7514 3142.2973 3167.1360 3170.9396
redmass: 3.9515 3.1897 4.6924 3.8022 5.9170 2.7611 3.7740 3.5685 3.9101 3.4175 2.9522 1.8224 3.0370 1.8715 1.4955 7.2083 3.3772 2.0256 3.6261 2.3735 2.4470 2.8939 4.7250 3.3131 2.9568 3.4324 2.4245 4.1481 2.0493 2.3928 6.9285 4.7508 3.0783 4.5693 2.8616 1.7518 1.4994 1.3154 2.0891 2.5107 1.5105 2.4800 1.7489 2.4517 3.9943 1.3658 1.2990 1.3608 8.6761 2.6152 2.6370 1.2253 1.8950 2.7972 2.1605 1.5013 2.0753 1.2598 1.3919 2.0146 2.4688 1.2857 1.9081 1.5991 1.2767 1.2409 1.5238 1.7261 2.9517 1.2584 1.1857 1.6099 1.3046 1.4401 1.4160 1.3382 2.0881 1.3511 1.4319 1.5625 1.4894 1.4536 3.7826 1.4858 3.4473 1.1080 1.2189 1.0906 1.0868 1.0879 1.0888 1.0513 1.0851 1.0785 1.0975 2.4965 7.6604 6.7506 6.2582 5.6263 1.0715 1.0703 1.0710 1.0602 1.0337 1.0612 1.0615 1.0613 1.0957 1.0875 1.0901 1.0930 1.1033 1.0893 1.1036 1.1042 1.0894 1.0903 1.0915 1.0978 1.0881 1.0941 1.0964
irintensity: 0.9173 0.0520 0.6963 1.3138 2.0394 2.9692 1.3457 4.2111 1.0817 1.9750 3.6888 0.2919 1.1415 1.1066 0.3405 7.1045 3.0313 3.4311 2.8955 15.6940 16.4580 0.0640 0.2234 0.1541 0.3714 0.9960 12.6804 42.6976 1.4910 6.8889 3.7483 5.3193 0.0215 3.2429 7.6134 2.8792 1.4957 17.9792 38.1857 39.7191 2.3223 5.8772 1.0678 7.5039 3.5238 2.3383 3.8540 0.9228 52.9983 74.6610 7.4314 39.5675 25.7913 27.5618 46.1026 40.6735 118.2725 0.2582 11.1355 76.3121 49.9018 5.4249 26.3427 3.0726 4.1337 155.1434 0.3653 42.5282 294.0876 9.1473 4.8119 17.3582 4.0004 22.5855 5.7936 24.7889 48.0380 20.1015 0.3479 43.2586 13.0878 13.9908 37.9675 10.7117 69.2169 13.8609 7.3182 7.6675 12.5061 7.4579 6.8876 17.6404 6.5437 56.8416 11.8241 208.8137 509.5356 2.7191 171.6794 182.4336 53.8834 134.9239 116.0762 43.3155 94.2930 26.2380 34.7535 36.9576 9.9168 59.4664 87.7823 27.3665 20.4102 26.6558 104.5771 44.1738 0.9368 13.1008 24.4123 9.0057 6.9747 16.9826 7.4162
temp: 298.150 k
press: 1.00000 atm
elementType: 8 8 7 6 6 6 6 6 6 6 6 6 6 6 6 6 6 6 6 6 1 1 1 1 1 1 1 1 1 1 1 1 1 1 1 1 1 1 1 1 1 1 1
symmnumber: 1
zpe: 955420.4 jmol-1
zpe.correction: 0.363900 hartree
zpe.thermalcorrener: 0.383876 hartree
zpe.thermalcorrenthalpy: 0.384821 hartree
zpe.thermalcorrgfe: 0.312920 hartree
zpe.sumelectzpe: -865.256423 hartree
zpe.sumelectthermal: -865.236447 hartree
zpe.sumelectthermalent: -865.235503 hartree
zpe.sumelectthermalfe: -865.307403 hartree
dipole: 3.7643 1.5572 -0.3276
dipole: 4.0868
quadrupole: -77.2444 -122.9210 -124.6682
quadrupole: -11.5763 1.9927 -1.3225
quadrupole: 31.0335 -14.6431 -16.3903 -11.5763 1.9927 -1.3225
hfenergy: -865.6203235 hartree
pointgroup: C01 [X(C17H23N1O2)]
dipole: 1.4884521 0.5942564 -0.1290271 debye
polarizability: 392.1809733|13.5899489|183.3597202|5.1934467|0.7998244|117.4570922 unknown
InChI: InChI=1S/C17H23NO2/c1-20-17-9-6-15(7-10-17)5-8-16(19)11-14-18-12-3-2-4-13-18/h5-10H,2-4,11-14H2,1H3
charge 0 multiplicity 1
43 atoms
O  -0.927713 -2.161589 -0.177851
O  6.982312 1.11988 0.244311
N  -4.596377 -0.010164 0.14941
C  -4.902145 1.103253 -0.786124
C  -5.778813 -0.893411 0.334949
C  -6.085752 1.953265 -0.280367
C  -6.985997 -0.10479 0.881467
C  -7.336078 1.073637 -0.054408
C  -3.398997 -0.789249 -0.25407
C  -2.090526 -0.006338 -0.057088
C  -0.842513 -0.89446 -0.103143
C  0.463108 -0.190778 -0.033639
C  1.645647 -0.88784 -0.036636
C  3.007236 -0.359918 0.033363
C  3.309294 1.035925 0.115318
C  4.100211 -1.271514 0.022485
C  4.631609 1.489214 0.182757
C  5.43776 -0.833633 0.090306
C  5.705619 0.556534 0.171174
C  8.133617 0.210196 0.240706
H  -5.14474 0.707351 -1.810223
H  -4.003969 1.739602 -0.88694
H  -5.499175 -1.698581 1.039786
H  -6.072225 -1.385047 -0.631943
H  -6.298605 2.757428 -1.011235
H  -5.795916 2.433764 0.674251
H  -6.730623 0.284269 1.886224
H  -7.850735 -0.787006 0.99361
H  -8.163636 1.674735 0.367928
H  -7.687736 0.676769 -1.029564
H  -3.46623 -1.146459 -1.313096
H  -3.348201 -1.697333 0.372918
H  -1.969322 0.80319 -0.805168
H  -2.12491 0.499049 0.931431
H  0.435823 0.905083 0.025836
H  1.544752 -1.982603 -0.097771
H  2.496107 1.769347 0.12672
H  3.892439 -2.346626 -0.039783
H  4.8697 2.555258 0.246028
H  6.248594 -1.567625 0.080188
H  8.173818 -0.380409 -0.694576
H  8.10746 -0.471098 1.112668
H  9.014627 0.86462 0.305893
