program: Gaussian 09
title: 000200190
version: EM64L-G09RevD.01
frameworkgroup: C1[X(C14H18N2O3)]
method: RPBEPBE
basis: SDD
operation: Freq
keyword: #p
keyword: freq=noraman
keyword: PBEPBE/SDD
title: #p freq=noraman PBEPBE/SDD
converged: YES YES NO NO
title: Mulliken charges:
elementType: O O O N N C C C C C C C C C C C C C C H H H H H H H H H H H H H H H H H H
charge: -0.205997 -0.201159 -0.198831 -0.075307 0.028274 -0.348745 -0.368826 -0.399132 -0.392060 -0.398236 -0.351592 -0.536973 0.121362 0.306883 -0.315731 -0.326324 -0.376915 -0.364910 0.383415 0.173732 0.197802 0.215296 0.170840 0.193474 0.204100 0.204433 0.194533 0.215741 0.190554 0.198886 0.231271 0.241439 0.256956 0.261902 0.289775 0.289117 0.290956
chargesum: 0.00000
title: Mulliken charges with hydrogens summed into heavy atoms:
elementType: O O O N N C C C C C C C C C C C C C C
charge: -0.205997 -0.201159 -0.198831 -0.075307 0.028274 0.022788 0.017310 -0.001558 0.006905 0.008059 0.078564 -0.038578 0.121362 0.306883 -0.053829 -0.036549 -0.087798 -0.073955 0.383415
polarizability: 2.85910762e+02 9.13618438e+00 1.77400226e+02 1.40445450e+00 -5.40083304e+00 1.04117795e+02
1716.lowfreq: -22.7605 -2.0257 -0.0005 0.0002 0.0003 3.2450 13.9405 23.3661 39.2048
frequency: 7.2761 23.2799 39.1070 53.6699 65.5426 76.3650 99.7265 123.4552 172.0972 184.5956 227.0389 237.6578 245.5327 286.1333 304.5508 348.6164 384.9657 407.2711 436.3782 440.3940 446.1712 468.3099 490.0353 523.3648 549.6044 561.5284 623.1662 667.1948 668.6999 732.9423 735.2944 781.1167 790.9344 803.0279 817.0481 852.7899 855.3859 856.1822 881.5909 907.0151 957.2257 974.6231 993.0897 999.5971 1007.6101 1014.3212 1029.7554 1049.0933 1070.7874 1090.6432 1094.0168 1107.5860 1110.8940 1120.4538 1150.4172 1155.4943 1169.3232 1181.2387 1198.6076 1217.8480 1238.7625 1258.6411 1266.4073 1284.4583 1295.6077 1297.0086 1307.3597 1331.4138 1338.8544 1345.4922 1350.3372 1366.1235 1368.3051 1395.5445 1403.5192 1411.6129 1429.9005 1451.7339 1459.9097 1461.6003 1466.7381 1469.5436 1474.6278 1479.9207 1575.5499 1600.3213 1612.8320 2820.8937 2832.5932 2882.0546 2967.8357 2969.7326 2984.5737 2986.7226 3016.1331 3023.7241 3027.2674 3036.8779 3045.8606 3048.7849 3055.3470 3160.5120 3161.7743 3184.9868 3187.5712
redmass: 3.7796 4.3044 5.1255 6.3282 4.6284 6.7271 3.0958 3.0065 4.8320 3.9571 2.2946 5.6639 2.8595 8.1979 2.0741 4.3839 1.8510 2.8640 3.6641 3.3785 3.0342 4.2208 8.5038 5.4404 1.8500 2.4251 7.1211 4.4179 6.6191 4.3955 3.2524 5.4691 1.6387 1.6866 3.6113 1.3902 1.5325 2.1876 1.4990 2.3599 1.3046 3.6669 1.3655 3.1164 2.6868 1.3800 1.9277 2.1842 1.8012 3.2011 2.0176 1.8438 1.5091 2.6101 1.2852 2.4055 1.2490 1.3137 2.1102 5.4425 2.0036 1.2568 1.1747 1.2139 1.3783 1.3195 1.8502 1.2937 1.4095 1.5269 1.4647 3.4652 1.7929 1.4754 10.7266 3.7232 1.1088 1.0904 1.0864 1.0867 1.0882 1.0895 2.2471 1.1062 8.2140 7.0170 7.4271 1.0715 1.0701 1.0705 1.0631 1.0599 1.0613 1.0614 1.0952 1.0858 1.0898 1.0947 1.1033 1.0909 1.1037 1.0893 1.0900 1.0951 1.0965
irintensity: 0.5431 0.1291 0.1096 1.3762 0.7014 6.6066 0.2196 1.0915 1.2059 10.9068 1.3262 0.9422 0.1766 4.5022 3.0120 5.5862 2.9013 0.0215 2.1758 0.9453 1.5344 0.8248 10.3196 7.9891 1.2498 3.4743 0.2276 22.7623 3.4245 17.7197 7.8982 52.6996 16.9105 1.7863 6.7529 3.1534 6.5354 11.6787 46.1959 4.9544 5.1916 59.9441 3.0780 1.4497 2.6929 0.4827 9.0902 9.4283 3.6641 10.1259 7.6163 48.5689 7.6001 2.6999 5.3942 28.4127 7.1619 15.1415 117.7379 317.3298 25.2090 7.9499 5.6761 2.5210 17.0773 12.9340 102.7458 10.0192 3.2990 34.4574 14.9159 78.4841 26.2233 1.9347 1.1975 83.8707 18.3163 7.9329 1.0687 13.8801 9.1712 12.3819 2.5209 9.5758 70.1691 7.2395 26.3758 50.0951 146.9618 86.3359 41.6515 45.7230 30.7102 33.2168 15.7361 85.7213 45.3758 39.7075 22.0216 30.2081 97.6875 5.9200 1.2456 0.4918 1.6457
temp: 298.150 k
press: 1.00000 atm
elementType: 8 8 8 7 7 6 6 6 6 6 6 6 6 6 6 6 6 6 6 1 1 1 1 1 1 1 1 1 1 1 1 1 1 1 1 1 1
symmnumber: 1
zpe: 789553.6 jmol-1
zpe.correction: 0.300725 hartree
zpe.thermalcorrener: 0.318486 hartree
zpe.thermalcorrenthalpy: 0.319430 hartree
zpe.thermalcorrgfe: 0.251119 hartree
zpe.sumelectzpe: -877.944042 hartree
zpe.sumelectthermal: -877.926281 hartree
zpe.sumelectthermalent: -877.925337 hartree
zpe.sumelectthermalfe: -877.993648 hartree
dipole: 4.9230 -0.8010 -0.4466
dipole: 5.0077
quadrupole: -141.1850 -118.0385 -112.5199
quadrupole: -10.1137 -0.1137 1.5977
quadrupole: -17.2705 5.8760 11.3946 -10.1137 -0.1137 1.5977
hfenergy: -878.2447673 hartree
pointgroup: C01 [X(C14H18N2O3)]
dipole: -1.9303175 0.3424674 -0.1953292 debye
polarizability: 286.0534274|7.9474826|176.5284166|2.4331517|9.1008478|104.8469392 unknown
InChI: InChI=1S/C14H18N2O3/c17-14(8-11-15-9-2-1-3-10-15)12-4-6-13(7-5-12)16(18)19/h4-7H,1-3,8-11H2
charge 0 multiplicity 1
37 atoms
O  -0.131212 -2.4770 -0.355902
O  5.635633 2.026621 0.505456
O  6.422275 -0.077253 0.107317
N  -3.636787 -0.070435 0.124443
N  5.462164 0.770658 0.262953
C  -3.888366 0.92901 -0.94674
C  -4.879258 -0.821088 0.453131
C  -4.97815 1.938057 -0.528264
C  -5.995586 0.131375 0.924353
C  -6.285884 1.207577 -0.146707
C  -2.513126 -0.984494 -0.197877
C  -1.151353 -0.28167 -0.050592
C  0.03211 -1.236529 -0.166676
C  1.43188 -0.675535 -0.047226
C  1.682267 0.697629 0.219616
C  2.528368 -1.565826 -0.208987
C  3.001143 1.178897 0.324355
C  3.851562 -1.102901 -0.110275
C  4.06609 0.268153 0.156001
H  -4.202434 0.4196 -1.897581
H  -2.948364 1.469507 -1.163448
H  -4.640809 -1.550347 1.249662
H  -5.244885 -1.403515 -0.434325
H  -5.155389 2.650906 -1.356578
H  -4.611574 2.517433 0.341213
H  -5.671998 0.620742 1.863362
H  -6.907851 -0.454526 1.147653
H  -7.040309 1.928748 0.220262
H  -6.713107 0.722508 -1.048956
H  -2.601248 -1.424239 -1.222055
H  -2.543345 -1.835196 0.506311
H  -1.030606 0.521884 -0.804788
H  -1.124098 0.225163 0.936172
H  0.850778 1.396177 0.350548
H  2.310001 -2.61909 -0.41132
H  3.220356 2.22947 0.531086
H  4.709916 -1.768372 -0.232199
