program: Gaussian 09
title: 000200168
version: EM64L-G09RevD.01
frameworkgroup: C1[X(C9H13NO3S)]
method: RPBEPBE
basis: SDD
operation: Freq
keyword: #p
keyword: freq=noraman
keyword: PBEPBE/SDD
title: #p freq=noraman PBEPBE/SDD
converged: YES YES NO NO
title: Mulliken charges:
elementType: S O O O N C C C C C C C C C H H H H H H H H H H H H H
charge: 0.315540 -0.277975 -0.204854 -0.270056 -0.402029 -0.368298 -0.345662 -0.265207 -0.686779 0.087911 -0.766042 0.212324 -0.415592 0.272931 0.207010 0.207462 0.197046 0.197011 0.222047 0.223634 0.211602 0.211730 0.218622 0.301643 0.301560 0.349135 0.265287
chargesum: 0.00000
title: Mulliken charges with hydrogens summed into heavy atoms:
elementType: S O O O N C C C C C C C C C
charge: 0.315540 -0.277975 -0.204854 -0.270056 -0.052894 0.046173 0.048395 0.180474 -0.044824 0.087911 -0.162839 0.212324 -0.150305 0.272931
polarizability: 2.42750932e+02 3.36711956e-01 1.21074379e+02 1.07141595e+00 3.12915985e-01 7.53142479e+01
1716.lowfreq: -6.4956 -4.2872 0.0009 0.0013 0.0021 5.2010 25.3184 47.8276 55.7730
frequency: 24.0970 47.8215 55.3327 74.5128 91.6573 112.7069 121.5806 135.9280 159.2116 209.2791 227.6093 233.4735 256.2109 286.0026 402.2921 417.5238 441.9163 485.1570 518.5762 545.6238 621.0643 647.5027 668.6369 711.4587 712.4367 738.7450 741.2705 798.2671 827.3318 855.8820 890.4103 892.9349 916.3612 932.5348 981.7007 1042.3194 1082.0315 1119.0822 1119.8847 1124.6037 1147.5202 1212.0477 1214.2724 1228.7491 1258.7327 1270.6679 1273.4679 1287.8828 1293.1263 1344.7402 1370.8436 1392.0658 1412.5974 1425.4072 1469.6575 1473.4708 1477.5224 1481.4007 1491.5776 1574.6385 1629.1445 1662.1390 2970.2851 2976.5072 2990.6597 2999.5808 3013.3901 3042.9644 3050.5332 3068.7430 3076.8126 3077.5889 3121.6707 3162.9612 3542.9971
redmass: 4.5169 5.3665 2.0156 3.1164 5.0207 2.2414 5.1768 3.9921 3.8294 5.4693 1.2135 4.1584 4.6075 10.5792 3.7221 5.6951 5.8887 11.0185 2.1097 4.7327 7.7092 5.8009 1.9619 2.1055 6.2130 6.7206 1.0748 1.1376 1.6311 4.8136 1.6303 2.9142 2.6556 1.1641 6.0964 3.4012 2.2267 1.1650 2.2598 2.5994 1.4764 1.3523 1.8164 2.8628 2.2244 1.1849 1.3713 1.0817 2.1318 1.4311 1.5519 1.2175 1.9208 1.1116 1.0797 1.0642 1.0421 1.0662 1.0924 11.9155 7.1562 9.2952 1.0587 1.0367 1.0598 1.0567 1.1002 1.1037 1.0571 1.1046 1.0996 1.1038 1.1068 1.0918 1.0780
irintensity: 0.0197 0.1081 0.1620 1.1305 7.3002 0.3118 2.5300 0.1337 9.7765 0.0602 0.7366 10.5179 0.3956 13.9277 8.7428 9.7031 4.9321 23.8200 10.7651 14.2870 8.4485 2.4387 29.5524 41.7607 5.2766 5.4666 9.9058 0.1403 95.1155 8.0771 5.1260 2.6318 4.3644 0.5711 167.7748 57.6743 46.5658 0.0944 490.2832 11.9953 2.4508 0.6971 228.3637 126.8542 123.2750 4.1275 23.3927 0.0807 25.7106 0.0962 17.5772 6.5463 22.9077 19.3277 0.9269 0.3414 13.1266 6.8358 18.7318 241.4039 781.9319 244.8646 26.6446 34.2196 13.9344 47.8809 6.5640 1.3746 6.6512 0.0564 54.7637 127.4491 0.3347 4.4317 41.8697
temp: 298.150 k
press: 1.00000 atm
elementType: 16 8 8 8 7 6 6 6 6 6 6 6 6 6 1 1 1 1 1 1 1 1 1 1 1 1 1
symmnumber: 1
zpe: 554812.1 jmol-1
zpe.correction: 0.211317 hartree
zpe.thermalcorrener: 0.226554 hartree
zpe.thermalcorrenthalpy: 0.227498 hartree
zpe.thermalcorrgfe: 0.166800 hartree
zpe.sumelectzpe: -1028.178109 hartree
zpe.sumelectthermal: -1028.162872 hartree
zpe.sumelectthermalent: -1028.161928 hartree
zpe.sumelectthermalfe: -1028.222626 hartree
dipole: -1.7117 -0.9639 0.0038
dipole: 1.9645
quadrupole: -91.7233 -91.3453 -90.1418
quadrupole: 7.6663 0.0722 0.1538
quadrupole: -0.6532 -0.2751 0.9283 7.6663 0.0722 0.1538
hfenergy: -1028.3894261 hartree
pointgroup: C01 [X(C9H13N1O3S1)]
dipole: -0.6604953 0.399571 0.0377682 debye
polarizability: 242.5890398|-4.5007715|120.4570812|1.0391338|5.9050433|76.0934372 unknown
InChI: InChI=1S/C9H13NO3S/c1-2-3-4-13-9(12)5-8-10-7(11)6-14-8/h5,10H,2-4,6H2,1H3
charge 0 multiplicity 1
27 atoms
S  2.434506 -1.553532 -0.243888
O  -1.687081 0.438176 -0.004605
O  5.432226 1.103958 0.13267
O  -0.399691 -1.506864 -0.250614
N  3.085768 1.006969 0.105637
C  -4.113468 0.547983 -0.075863
C  -5.453295 -0.216837 -0.195429
C  -2.915099 -0.399674 -0.127153
C  -6.674189 0.726891 -0.153713
C  1.953094 0.19219 -0.010813
C  4.275215 -1.067131 -0.172318
C  4.36918 0.443659 0.036048
C  0.661173 0.654202 0.044104
C  -0.470925 -0.253512 -0.08522
H  -4.029038 1.286936 -0.89597
H  -4.089847 1.116673 0.873751
H  -5.530314 -0.958488 0.625438
H  -5.465129 -0.795749 -1.141244
H  -2.925358 -1.13187 0.702155
H  -2.865845 -0.961745 -1.078622
H  -6.703601 1.295724 0.79452
H  -6.638091 1.45818 -0.982806
H  -7.621187 0.163767 -0.240047
H  4.76589 -1.346891 -1.117494
H  4.762655 -1.593247 0.663006
H  2.99116 2.016408 0.242789
H  0.449894 1.717925 0.186183
