program: Gaussian 09
title: 000200165
version: EM64L-G09RevD.01
frameworkgroup: C1[X(C5H9O4PS)]
method: RPBEPBE
basis: SDD
operation: Freq
keyword: #p
keyword: freq=noraman
keyword: PBEPBE/SDD
title: #p freq=noraman PBEPBE/SDD
converged: NO NO NO NO
title: Mulliken charges:
elementType: S P O O O O C C C C C H H H H H H H H H
charge: -0.149040 0.892006 -0.437296 -0.439114 -0.439137 -0.463716 -0.004895 -0.249047 -0.241528 -0.241551 -0.389131 0.219186 0.219157 0.210655 0.262271 0.262315 0.210699 0.206924 0.206917 0.364325
chargesum: 0.00000
title: Mulliken charges with hydrogens summed into heavy atoms:
elementType: S P O O O O C C C C C
charge: -0.149040 0.892006 -0.437296 -0.439114 -0.439137 -0.099391 -0.004895 0.189297 0.231398 0.231462 0.024710
polarizability: 1.52663724e+02 -5.40489614e+00 7.84701979e+01 2.35187390e-04 -3.12943799e-04 7.51589916e+01
1716.lowfreq: -111.5449 -11.3557 -0.0021 -0.0019 0.0019 12.7926 17.7369 95.8723 121.8042
frequency: -111.5427 95.8222 121.8038 147.1690 179.0476 220.9755 264.3333 265.5522 294.5001 305.7930 342.0446 365.4255 416.4955 451.1505 460.7898 537.0023 607.9065 635.8658 640.0295 729.7416 826.4942 888.8645 901.1319 916.7262 922.3520 946.8396 966.3277 998.3221 1009.9896 1110.6596 1113.4384 1127.9194 1151.4376 1194.8034 1200.1035 1286.8861 1306.7744 1315.8525 1316.8257 1360.4696 1411.4773 1464.2069 1466.4224 1476.9293 1488.2822 2936.6150 2987.9858 2989.2710 3007.5870 3011.3842 3053.5768 3094.7898 3098.6138 3589.8479
redmass: 2.9461 6.1292 9.8297 6.5918 4.5393 2.1593 4.4494 1.1678 6.3373 8.3393 5.6127 2.7134 8.8016 3.8638 3.5974 9.3047 5.7997 7.4810 9.9470 9.4634 4.8804 3.9911 10.7815 1.3473 2.7437 3.3683 3.9006 6.1695 1.6676 2.4587 1.5299 1.3987 1.0560 1.0737 1.2715 1.9467 1.6217 1.3376 1.1948 1.3778 1.3549 1.0820 1.0783 1.0747 1.0919 1.0545 1.1066 1.0568 1.0622 1.0624 1.1092 1.1052 1.1050 1.0669
irintensity: 0.0059 4.0929 0.8310 6.2625 3.1781 2.6723 20.2467 168.5107 2.8472 3.8228 0.2368 1.7220 6.0689 0.0698 0.8189 0.9268 37.7529 122.3177 107.8445 182.9215 104.5638 29.0024 9.6516 0.0031 0.9023 126.7756 182.6318 58.9063 3.1500 88.6844 4.3609 0.5406 0.1365 0.0608 19.4671 16.1978 0.1711 9.5204 6.3870 18.3341 1.0895 4.0499 6.4513 4.6470 4.4545 51.1992 27.1878 55.1619 59.8149 40.2181 28.5934 3.8959 16.5553 10.2120
temp: 298.150 k
press: 1.00000 atm
elementType: 16 15 8 8 8 8 6 6 6 6 6 1 1 1 1 1 1 1 1 1
symmnumber: 1
zpe: 382928.6 jmol-1
zpe.correction: 0.145850 hartree
zpe.thermalcorrener: 0.156570 hartree
zpe.thermalcorrenthalpy: 0.157514 hartree
zpe.thermalcorrgfe: 0.109702 hartree
zpe.sumelectzpe: -1235.196448 hartree
zpe.sumelectthermal: -1235.185728 hartree
zpe.sumelectthermalent: -1235.184784 hartree
zpe.sumelectthermalfe: -1235.232596 hartree
dipole: -9.0266 2.0626 0.0000
dipole: 9.2593
quadrupole: -71.3626 -82.8304 -81.8160
quadrupole: -4.1361 0.0001 0.0006
quadrupole: 7.3071 -4.1608 -3.1463 -4.1361 0.0001 0.0006
hfenergy: -1235.3422978 hartree
pointgroup: C01 [X(C5H9O4P1S1)]
dipole: -3.5223898 0.9291135 -0.0042427 debye
dipolederiv: -0.6769207 0.0555314 -0.0001575 0.0540861 -0.2723061 -0.000004 -0.0001493 -0.0000018 -0.2676123 2.7586781 -0.1975982 0.0005819 -0.2001559 1.3754928 -0.0000334 0.0006585 -0.0000112 1.351765 -1.1499289 0.4343169 -0.0027524 0.2229732 -0.7985486 0.002521 -0.0012141 0.0024057 -0.434265 -1.2895502 -0.0682081 0.3383943 0.0351154 -0.4731936 0.0663622 0.14887 0.0926341 -0.6403444 -1.290226 -0.073377 -0.3365139 0.0327889 -0.4756103 -0.0688455 -0.1485792 -0.0950178 -0.6373091 -0.5012826 -0.2868406 0.001889 -0.3701399 -0.545325 0.0002526 0.0024463 0.0002111 -0.542681 -0.31451 0.0061087 0.0001113 0.06709 -0.0698379 -0.0000626 -0.0003077 0.0000331 -0.0631539 0.6472373 -0.3229963 0.0021191 0.0023718 0.2531185 0.0002425 -0.0002589 0.0004755 0.2862088 0.7006828 0.0379917 -0.2166349 -0.1294462 0.2149135 0.0759059 0.0660523 0.0432104 0.2251893 0.7009567 0.0411855 0.2154184 -0.1304237 0.2130991 -0.0754956 -0.0647536 -0.0430597 0.2267607 0.5745088 0.1957734 -0.0014116 0.2054681 0.4965387 -0.000876 -0.0015304 -0.0008984 0.3840896 -0.0451151 0.0982124 -0.0519205 0.0362627 0.007521 0.0575395 -0.0776765 0.1271877 -0.0643492 -0.0449394 0.0987863 0.0504494 0.0373153 0.0048143 -0.0585714 0.0771396 -0.1283503 -0.0618587 -0.0520338 0.0230971 0.0811052 0.0803206 0.015212 -0.1304245 0.0574901 -0.0610795 -0.0669746 -0.0178114 -0.0532488 0.0484458 -0.0599672 -0.0387995 0.0202549 0.0014218 -0.0169598 0.0873547 -0.0177405 -0.0538891 -0.0474508 -0.0599739 -0.03882 -0.018254 -0.0003814 0.0189377 0.0874354 -0.0522021 0.021957 -0.0814702 0.0795583 0.0181601 0.1289587 -0.0587034 0.0597613 -0.0696589 0.0019601 -0.0090436 -0.0282464 -0.0147481 -0.0741199 0.0922131 -0.0805843 0.1410702 -0.0980351 0.0021288 -0.0088063 0.0282419 -0.0137994 -0.077225 -0.0924572 0.0806681 -0.141364 -0.0950384 0.066108 0.0610477 -0.0001982 0.1253039 0.264916 0.000774 -0.0006079 0.0008157 0.3924772 unknown
polarizability: 152.2224214|-7.8587439|78.911368|0.0111452|-0.0207619|75.1591237 unknown
InChI: InChI=1S/C5H9O4PS/c6-1-5-2-7-10(11,8-3-5)9-4-5/h6H,1-4H2
charge 0 multiplicity 1
20 atoms
S  3.775133 -0.407824 0.001191
P  1.77261 -0.135275 0.000421
O  1.194805 1.525249 -0.011512
O  0.870387 -0.777553 1.354779
O  0.868737 -0.797422 -1.343192
O  -3.168563 -0.822449 0.007669
C  -1.006807 0.264653 -0.000837
C  -0.2964 1.648378 -0.01144
C  -0.60799 -0.524064 1.2783
C  -0.609605 -0.543073 -1.26857
C  -2.529298 0.499205 -0.001596
H  -0.562499 2.222753 -0.918894
H  -0.561328 2.23585 0.887943
H  -0.871601 0.047354 2.187754
H  -1.103947 -1.507624 1.298123
H  -1.105427 -1.526869 -1.272899
H  -0.874614 0.014382 -2.186243
H  -2.81571 1.076227 -0.907722
H  -2.814709 1.088236 0.897078
H  -4.152574 -0.724535 0.007646
