program: Gaussian 09
title: 000200158
version: EM64L-G09RevD.01
frameworkgroup: C1[X(C8H16FN)]
method: RPBEPBE
basis: SDD
operation: Freq
keyword: #p
keyword: freq=noraman
keyword: PBEPBE/SDD
title: #p freq=noraman PBEPBE/SDD
converged: YES YES NO NO
title: Mulliken charges:
elementType: F N C C C C C C C C H H H H H H H H H H H H H H H H
charge: -0.251766 -0.330570 -0.066675 -0.437154 -0.404418 -0.391213 -0.392207 -0.385276 -0.379111 -0.204039 0.206759 0.177258 0.222340 0.211044 0.179269 0.199110 0.193341 0.190870 0.199132 0.200276 0.187802 0.239726 0.209046 0.224226 0.188010 0.214222
chargesum: 0.00000
title: Mulliken charges with hydrogens summed into heavy atoms:
elementType: F N C C C C C C C C
charge: -0.251766 -0.090845 0.140084 -0.037557 -0.014105 0.001238 -0.002206 0.002802 0.054161 0.198194
polarizability: 1.11653216e+02 8.70961216e-01 8.60012739e+01 1.23242305e+00 -8.00707501e-01 7.69987526e+01
1716.lowfreq: -32.0687 -6.2782 -0.0006 0.0007 0.0008 16.2375 41.0227 67.3527 76.3826
frequency: 38.9858 66.7394 76.2774 124.8541 198.0977 221.2402 244.0381 274.7130 319.3439 406.2540 426.6204 456.2689 477.3396 558.6023 644.2851 777.9775 787.5769 818.7366 838.1389 878.6307 891.0057 916.0842 927.3035 958.3568 1025.6228 1041.0902 1050.1331 1068.6660 1081.2579 1098.8682 1109.8816 1142.0864 1145.6716 1178.9237 1194.6717 1247.1929 1251.7730 1255.0345 1271.9495 1299.4021 1305.9974 1324.0300 1327.9744 1333.7786 1339.6055 1340.7502 1359.2405 1386.9766 1455.1698 1458.1332 1460.9157 1463.1277 1467.1945 1470.9993 1477.5054 1488.2823 2921.3917 2948.5208 2950.3540 2965.1101 2965.8798 2966.4471 2968.5524 3010.4827 3023.0391 3028.7887 3030.3423 3039.0397 3040.7492 3047.2558 3097.5340 3426.7615
redmass: 4.0272 2.8770 2.6914 2.8258 2.3365 1.8999 3.9325 5.1135 1.7859 2.7160 2.7988 2.3374 2.5431 2.1882 1.4467 1.6074 1.8544 1.1596 2.0991 1.7545 1.5693 1.8528 6.6046 2.3809 2.2809 1.8431 1.1609 1.7997 2.0456 1.8933 2.5031 1.6424 2.5730 1.5385 1.5788 1.3583 1.2933 1.2894 1.1847 1.1786 1.3061 1.3300 1.2924 1.4057 1.4562 1.4546 1.4452 1.3876 1.1743 1.1159 1.0910 1.0890 1.0894 1.0855 1.0967 1.0843 1.0687 1.0722 1.0645 1.0744 1.0646 1.0611 1.0640 1.0597 1.0972 1.0969 1.0990 1.1000 1.0900 1.0991 1.1097 1.0738
irintensity: 0.3613 0.6603 3.7879 1.9976 3.5860 1.2746 6.3066 7.0817 1.1388 3.9670 2.5512 0.4729 16.7456 1.7398 98.5060 2.2044 2.1515 2.4870 3.1425 6.3075 17.2313 1.5539 84.1041 6.0906 12.5305 1.7476 1.1707 10.6471 14.4000 15.2903 0.2403 4.7316 57.4084 1.3923 0.0648 0.3394 6.8916 2.4261 2.3615 0.9565 0.2104 6.7771 1.6306 0.9702 0.3601 0.8108 6.8804 3.3497 12.0764 7.4780 7.2615 10.0087 3.3321 25.8162 3.5326 5.3576 61.7953 10.6157 20.6797 23.0756 29.9766 32.8460 75.2863 37.4868 79.8566 69.6068 25.3929 45.0950 24.2333 94.7495 48.8245 0.9119
temp: 298.150 k
press: 1.00000 atm
elementType: 9 7 6 6 6 6 6 6 6 6 1 1 1 1 1 1 1 1 1 1 1 1 1 1 1 1
symmnumber: 1
zpe: 608179.2 jmol-1
zpe.correction: 0.231643 hartree
zpe.thermalcorrener: 0.242477 hartree
zpe.thermalcorrenthalpy: 0.243421 hartree
zpe.thermalcorrgfe: 0.194288 hartree
zpe.sumelectzpe: -468.203287 hartree
zpe.sumelectthermal: -468.192454 hartree
zpe.sumelectthermalent: -468.191510 hartree
zpe.sumelectthermalfe: -468.240642 hartree
dipole: -2.7652 -0.3925 0.9047
dipole: 2.9358
quadrupole: -76.8544 -63.4608 -59.2086
quadrupole: -3.8730 2.6411 -0.6664
quadrupole: -10.3464 3.0471 7.2993 -3.8730 2.6411 -0.6664
hfenergy: -468.4349303 hartree
pointgroup: C01 [X(C8H16F1N1)]
dipole: 1.0416116 0.1255417 0.4830877 debye
dipolederiv: -0.7522441 -0.1549339 -0.1627113 -0.2422507 -0.3907403 -0.1193364 -0.2630649 -0.1199028 -0.4179743 -0.9428682 -0.0168248 0.0200994 0.0023632 -0.5163344 -0.2045343 -0.020601 -0.2067186 -0.2243582 0.6741981 0.0029052 -0.0560504 0.0493645 0.3248517 -0.0012766 -0.1631222 -0.0393334 0.1749225 -0.0720836 -0.043293 0.0140316 -0.0279104 0.0522155 -0.0794329 -0.0054265 -0.0431802 0.1367925 -0.1647661 0.0058658 0.0456016 0.0716835 -0.0113086 -0.0594906 0.0790896 -0.0579278 0.1207001 0.0693804 0.0145392 0.0194124 0.0056821 0.0858525 -0.0226814 -0.0213451 -0.0550185 0.1285243 0.0575509 -0.0265095 -0.0010115 0.0363826 0.0937873 -0.0527672 -0.0152813 -0.0241787 0.1263751 0.0580247 0.0085878 -0.0108518 -0.0090486 0.0623505 -0.05098 0.0307712 -0.0482103 0.1226131 0.2623106 0.0823694 0.1085331 0.0391786 0.3397155 0.0167014 0.2761039 0.084115 0.2002295 0.7350038 0.1590694 0.149711 0.2036136 0.4650116 0.0709939 0.2014188 0.0935068 0.5334925 0.0044835 0.0091141 -0.0137822 0.0261498 -0.0230823 0.0757714 0.003629 0.094636 -0.1375822 0.0411069 -0.0195962 -0.0074706 -0.0334988 -0.0025877 0.150282 0.0032166 0.0771009 -0.1372972 -0.0153866 0.1231534 0.040546 0.105799 -0.1072249 -0.057511 0.0244555 -0.0376575 0.0572474 -0.0156946 -0.0959273 -0.080659 -0.0863516 -0.0511248 -0.0911639 -0.0912512 -0.1135305 -0.0341424 0.0366948 0.0200888 0.0159855 0.0099128 0.0012242 0.0741684 0.0179679 0.1418197 -0.1339197 -0.041791 -0.0917773 -0.0731827 -0.0843903 -0.0593995 -0.1104343 -0.0885347 -0.144554 -0.0430269 0.0302964 0.0389602 -0.0091558 0.0207924 -0.0084996 0.088979 0.0289925 0.1543556 -0.1182911 0.0354465 -0.0122959 -0.0433123 -0.0394642 0.0116173 0.1346423 -0.002433 0.0738787 -0.1450005 -0.0735236 0.107645 0.0403036 0.1268965 -0.1418335 -0.0776514 0.03158 -0.0473037 0.0573006 -0.2222589 -0.0488299 0.063084 -0.0656682 0.0366646 -0.0011684 0.0941668 0.0002468 0.0458748 0.0841752 0.0040623 -0.0013925 0.0414713 -0.034662 0.0921437 -0.0685165 0.0895237 -0.1452589 0.1378653 -0.0451052 -0.092637 -0.0949491 0.1844701 0.1601714 -0.035495 0.0791103 0.0299682 -0.0158473 0.0174469 -0.0279478 -0.0498272 -0.249213 -0.0630969 -0.0500336 -0.0264711 0.0346733 0.0538563 -0.0257009 0.0733982 -0.0169252 0.0420723 0.0696396 0.0328716 0.0342437 -0.1065823 0.0088106 -0.0350646 0.0149614 -0.0418253 0.0407797 0.0645752 0.0364927 0.0143849 -0.1729886 0.02726 0.0220511 -0.0255028 0.0528196 -0.1446022 -0.0065433 -0.0356514 0.0270649 0.0477084 unknown
polarizability: 110.1457585|6.1448695|83.8459041|1.515348|4.9335156|80.6615794 unknown
InChI: InChI=1S/C8H16FN/c9-6-7-10-8-4-2-1-3-5-8/h8,10H,1-7H2
charge 0 multiplicity 1
26 atoms
F  -4.37489 -1.115939 -0.944425
N  -1.093152 0.015281 0.4214
C  0.286812 0.258438 -0.07204
C  1.026482 1.183847 0.921631
C  1.113869 -1.034397 -0.32767
C  2.464509 1.505589 0.448608
C  2.548866 -0.710705 -0.812125
C  3.279568 0.216262 0.188574
C  -2.010357 -0.713831 -0.479634
C  -3.449153 -0.351306 -0.097523
H  0.189821 0.800062 -1.037474
H  1.072738 0.680476 1.912303
H  0.437522 2.109949 1.056463
H  0.595496 -1.675417 -1.067476
H  1.167487 -1.610663 0.621492
H  2.974879 2.138231 1.200227
H  2.415072 2.099913 -0.487455
H  2.496755 -0.209069 -1.801084
H  3.120772 -1.647134 -0.960442
H  4.288337 0.470732 -0.190302
H  3.422099 -0.324514 1.14737
H  -1.082157 -0.383547 1.371148
H  -1.898978 -1.82199 -0.467239
H  -1.818488 -0.380475 -1.516111
H  -3.678959 -0.624577 0.949787
H  -3.650852 0.720285 -0.265001
