program: Gaussian 09
title: 000200180
version: EM64L-G09RevD.01
frameworkgroup: C1[X(C15H11N3O3)]
method: RPBEPBE
basis: SDD
operation: Freq
keyword: #p
keyword: freq=noraman
keyword: PBEPBE/SDD
title: #p freq=noraman PBEPBE/SDD
converged: YES YES NO NO
title: Mulliken charges:
elementType: O O O N N N C C C C C C C C C C C C C C C H H H H H H H H H H H
charge: -0.231565 -0.220150 -0.203951 -0.053308 -0.646929 0.047923 0.267712 0.419588 -0.043024 -0.487747 -0.373313 -0.257718 0.101434 -0.324562 -0.339745 -0.269875 0.399518 -0.228832 -0.370125 0.264879 -0.307657 0.209462 0.224952 0.252764 0.262224 0.239924 0.231988 0.231910 0.268440 0.294013 0.329072 0.312700
chargesum: 0.00000
title: Mulliken charges with hydrogens summed into heavy atoms:
elementType: O O O N N N C C C C C C C C C C C C C C C
charge: -0.231565 -0.220150 -0.203951 -0.053308 -0.005157 0.047923 0.267712 0.419588 -0.043024 -0.278285 -0.148361 -0.004954 0.101434 -0.062338 -0.099821 -0.037887 0.399518 0.003078 -0.101685 0.264879 -0.013644
polarizability: 4.63839011e+02 -4.59168817e+00 2.72729142e+02 3.55208356e+00 -2.42520891e+00 7.80592577e+01
1716.lowfreq: -3.8445 -2.2292 -0.0006 -0.0004 0.0004 0.5634 13.3102 38.3689 42.1828
frequency: 13.2297 38.3632 42.1800 69.8828 98.0662 119.1430 132.1094 159.0865 170.7874 194.5691 225.8295 257.0600 300.7810 303.4810 335.5631 353.6665 399.5478 423.4508 433.5785 456.9917 489.9635 501.3251 513.6074 534.7765 560.5948 565.1067 591.7291 608.1904 659.1003 668.0009 676.4516 678.0567 723.0639 742.9683 768.9253 781.2606 795.9383 803.1248 854.5089 859.8436 872.9754 881.5679 902.5020 909.2936 924.9723 956.2700 968.1442 981.6402 993.2581 1025.0540 1028.8390 1036.4293 1070.4884 1128.7351 1137.5801 1176.0907 1180.1593 1219.1828 1229.7372 1248.2295 1259.4668 1294.5486 1305.0628 1325.5873 1338.3836 1346.6640 1374.2089 1390.1798 1405.4997 1424.2529 1466.7970 1486.0671 1508.0613 1544.8419 1546.3327 1590.9245 1614.9392 1623.6775 1632.2815 3130.7090 3132.3270 3136.0810 3142.2035 3151.6472 3161.3209 3172.7037 3228.4153 3259.2175 3554.8401 3709.7339
redmass: 6.2704 7.6385 6.7689 7.2567 4.7870 6.6250 5.3816 3.8505 4.3848 8.0783 3.6942 4.4777 3.9369 4.1751 4.6121 1.1754 6.9480 6.0396 3.3396 6.6877 5.1023 1.2980 6.7304 2.2836 5.3740 4.5506 6.6688 4.6751 5.8964 5.4261 4.2201 4.5418 8.9977 6.6169 1.3965 2.6955 4.9532 1.3668 3.1653 1.9328 1.6097 2.1868 1.4111 9.2174 6.0821 1.3290 1.1819 3.6619 1.3256 1.2837 2.0786 3.1399 2.0030 3.9616 1.5791 1.1972 2.0335 2.0917 3.2396 1.5174 1.7757 4.0584 3.4099 1.4769 4.4393 3.5249 3.5640 4.1481 6.4803 2.8239 3.3303 6.1670 4.5680 5.9337 6.4927 2.9757 2.5986 2.5055 5.2459 1.0925 1.0856 1.0907 1.0895 1.0873 1.0942 1.0998 1.0961 1.1029 1.0449 1.1045
irintensity: 2.3508 1.0674 0.0023 0.0629 4.4953 1.9732 0.1806 1.5440 4.9366 0.9920 0.9892 1.3336 8.1372 7.3869 6.1469 167.7816 8.3640 2.2694 19.4825 1.2332 3.8441 89.1815 0.8119 27.2616 2.1823 0.4144 20.9853 4.6179 3.0392 0.4411 16.3842 0.9380 12.9927 2.2169 86.9839 14.4455 4.6783 32.7256 8.6357 28.2076 11.0884 0.4231 3.0586 12.0073 0.2606 6.3207 55.4990 0.3853 0.0793 27.0211 15.1320 0.9183 0.8608 134.0274 9.1377 19.9407 2.8893 118.2139 394.5238 5.6378 18.2686 137.8196 1.4357 8.6548 36.4828 76.5189 14.5337 83.4272 122.5434 76.7449 62.2874 124.8812 135.9014 11.1003 74.0747 46.0471 289.3706 121.9798 230.9349 2.2742 3.1721 11.6232 8.6259 10.7350 25.7732 27.1703 0.8847 5.0458 126.0750 29.4952
temp: 298.150 k
press: 1.00000 atm
elementType: 8 8 8 7 7 7 6 6 6 6 6 6 6 6 6 6 6 6 6 6 6 1 1 1 1 1 1 1 1 1 1 1
symmnumber: 1
zpe: 610287.1 jmol-1
zpe.correction: 0.232446 hartree
zpe.thermalcorrener: 0.249840 hartree
zpe.thermalcorrenthalpy: 0.250785 hartree
zpe.thermalcorrgfe: 0.185020 hartree
zpe.sumelectzpe: -966.568808 hartree
zpe.sumelectthermal: -966.551414 hartree
zpe.sumelectthermalent: -966.550470 hartree
zpe.sumelectthermalfe: -966.616234 hartree
dipole: -3.4082 -6.8019 0.8888
dipole: 7.6597
quadrupole: -143.7421 -97.0749 -125.9285
quadrupole: -15.3889 5.2473 1.7894
quadrupole: -21.4936 25.1736 -3.6800 -15.3889 5.2473 1.7894
hfenergy: -966.8012545 hartree
pointgroup: C01 [X(C15H11N3O3)]
dipole: -1.2121046 2.5487409 -1.0565677 debye
polarizability: 462.2126162|-12.6824639|255.944047|-22.0928226|-54.5338764|96.4707473 unknown
InChI: InChI=1S/C15H11N3O3/c16-14-9-10(12-3-1-2-4-13(12)17-14)5-6-11-7-8-15(21-11)18(19)20/h1-9H,16H2
charge 0 multiplicity 1
32 atoms
O  2.860233 -0.342553 -0.144446
O  6.292694 -1.359545 0.064779
O  4.369982 -2.391242 0.805932
N  -4.260512 0.945249 -0.052369
N  -3.932828 3.195257 -0.56852
N  5.002265 -1.423072 0.224295
C  -2.32747 -0.624658 0.136985
C  -1.417072 0.471841 -0.168628
C  -3.746832 -0.318277 0.184498
C  -1.966896 1.743141 -0.397653
C  -1.913032 -1.972493 0.378385
C  0.032388 0.246457 -0.21015
C  -3.389026 1.942169 -0.338477
C  -4.680678 -1.361432 0.485672
C  0.969239 1.100686 -0.745131
C  -2.846515 -2.973396 0.669469
C  2.385245 0.848498 -0.745207
C  -4.240466 -2.664783 0.725505
C  3.481274 1.573563 -1.248585
C  4.251355 -0.321385 -0.295721
C  4.667137 0.829002 -0.962071
H  -1.317966 2.603971 -0.591055
H  -0.853362 -2.242444 0.33072
H  0.40877 -0.686585 0.223423
H  -5.740833 -1.092823 0.515298
H  0.672784 2.037326 -1.231344
H  -2.50728 -3.998277 0.853318
H  -4.96314 -3.455657 0.954583
H  3.421865 2.52986 -1.764368
H  5.696408 1.080815 -1.202648
H  -4.943608 3.294144 -0.504873
H  -3.356427 4.001642 -0.787617
