program: Gaussian 09
title: 000200154
version: EM64L-G09RevD.01
frameworkgroup: C1[X(C13H16N)]
method: RPBEPBE
basis: SDD
operation: Freq
keyword: #p
keyword: freq=noraman
keyword: PBEPBE/SDD
title: #p freq=noraman PBEPBE/SDD
converged: YES YES NO NO
title: Mulliken charges:
elementType: N C C C C C C C C C C C C C H H H H H H H H H H H H H H H H
charge: -0.163162 0.218945 0.397550 0.335701 -0.405169 -0.255652 -0.312483 -0.308298 -0.566613 0.438459 -0.337604 -0.786006 -0.641112 -0.785097 0.269713 0.258338 0.280463 0.263618 0.267192 0.266049 0.264151 0.265854 0.271264 0.272953 0.248040 0.260192 0.233272 0.241671 0.253559 0.254212
chargesum: 1.00000
title: Mulliken charges with hydrogens summed into heavy atoms:
elementType: N C C C C C C C C C C C C C
charge: -0.163162 0.218945 0.397550 0.335701 0.122883 0.024811 -0.048865 -0.041105 -0.300564 0.438459 -0.073453 0.024064 0.100392 -0.035656
polarizability: 2.20532164e+02 -1.40244597e+01 1.54505424e+02 -2.39974241e+00 -6.56148317e+00 7.57838666e+01
1716.lowfreq: -11.9184 -6.4678 0.0002 0.0003 0.0006 9.1105 70.0637 73.9334 87.8794
frequency: 70.0338 73.8552 87.8777 112.8272 178.3382 194.8689 199.4611 208.2701 236.4441 312.7393 343.8434 356.4213 389.9786 421.0253 428.1799 485.6249 507.7349 530.3209 551.5014 570.5521 631.6712 659.6052 705.0946 767.7232 769.1568 791.9578 820.4545 843.3531 881.3331 907.6071 927.2891 965.9017 981.7741 1000.1422 1008.8419 1012.9914 1041.9191 1053.0915 1064.1855 1089.2226 1135.8238 1176.1603 1181.6263 1202.7117 1233.6723 1256.3671 1281.7431 1293.1177 1327.4642 1350.4110 1380.1469 1391.9956 1403.7863 1407.0108 1410.7182 1424.2983 1464.0990 1464.7969 1468.5217 1472.4662 1472.6309 1482.2928 1486.4121 1523.9124 1524.7683 1580.7077 1597.5167 1630.8030 2989.5765 2992.0443 3003.0927 3065.0792 3067.8862 3075.0226 3097.2362 3106.1874 3106.2965 3120.7759 3130.0646 3144.9074 3147.1861 3158.8804 3189.9271 3193.3341
redmass: 1.1692 2.7844 2.5149 2.9305 3.3857 2.4437 1.2159 1.0484 2.7086 3.4386 3.3132 3.1797 3.2115 3.3165 3.0003 3.4804 3.4878 2.9894 4.7461 3.9150 4.1848 3.3671 5.5279 2.8956 2.8959 1.4848 1.5176 1.2599 2.5842 1.4451 3.0917 2.4166 1.3368 1.3925 1.4801 1.6724 1.6031 1.5996 3.0172 1.9799 1.7176 1.9198 1.3848 1.4713 1.9656 1.7350 2.1285 1.6837 1.7963 1.4726 3.2396 2.2131 1.2156 1.2612 1.2406 5.7511 1.1514 1.0621 1.0815 1.0892 1.0873 2.2180 1.1054 1.2291 2.3865 6.2736 6.3991 6.0245 1.0386 1.0419 1.0367 1.0653 1.0971 1.0945 1.0992 1.0998 1.0992 1.0986 1.1016 1.0922 1.0921 1.0921 1.0940 1.0968
irintensity: 1.2436 0.4562 0.0207 0.8073 1.1030 0.1779 0.3153 1.2859 0.6876 0.7679 4.4353 2.5306 0.9068 1.5587 5.5922 4.5205 1.4623 2.6128 0.8270 0.4719 0.9695 3.8765 1.5721 1.3228 1.9300 5.6570 22.9354 37.1493 0.5015 14.4227 1.5147 3.4171 0.4099 1.9516 8.5224 2.9253 9.0703 13.2021 5.5636 19.6636 0.9383 15.6301 1.5734 9.8453 4.9391 1.0014 16.5156 5.3933 15.5662 4.6570 6.8437 35.2733 14.3317 23.2837 24.8438 38.8829 28.1049 22.4893 19.1895 9.0835 15.6312 12.8351 17.7969 13.5765 75.9755 42.1604 70.5824 14.8839 3.2330 0.4320 5.9230 8.8782 6.2435 2.6761 7.7084 11.3805 11.4818 6.8659 7.8453 2.3283 2.7890 0.4254 2.5392 0.0905
temp: 298.150 k
press: 1.00000 atm
elementType: 7 6 6 6 6 6 6 6 6 6 6 6 6 6 1 1 1 1 1 1 1 1 1 1 1 1 1 1 1 1
symmnumber: 1
zpe: 674674.0 jmol-1
zpe.correction: 0.256970 hartree
zpe.thermalcorrener: 0.270161 hartree
zpe.thermalcorrenthalpy: 0.271105 hartree
zpe.thermalcorrgfe: 0.217816 hartree
zpe.sumelectzpe: -558.517442 hartree
zpe.sumelectthermal: -558.504251 hartree
zpe.sumelectthermalent: -558.503307 hartree
zpe.sumelectthermalfe: -558.556596 hartree
dipole: 2.3788 -0.0466 -0.2959
dipole: 2.3976
quadrupole: -38.6460 -58.4584 -83.6292
quadrupole: -0.6615 -1.5073 -2.4522
quadrupole: 21.5985 1.7861 -23.3847 -0.6615 -1.5073 -2.4522
hfenergy: -558.7744121 hartree
pointgroup: C01[X(C13H16N1)]
dipole: -0.9353461 -0.0043871 -0.122129 debye
polarizability: 221.1314699|-12.462062|153.9124873|3.1716394|6.3014279|75.7774972 unknown
InChI: InChI=1S/C13H16N/c1-4-14-11(3)6-7-12-9-10(2)5-8-13(12)14/h5-9H,4H2,1-3H3
charge 1 multiplicity 1
30 atoms
N  -1.389663 -0.335929 -0.235203
C  0.021248 -0.287633 -0.141337
C  0.666082 0.987617 0.072634
C  -2.166746 0.793098 -0.095494
C  -2.051312 -1.672041 -0.457006
C  -0.148334 2.151486 0.202056
C  0.833934 -1.453734 -0.251387
C  -1.536403 2.048036 0.124844
C  2.092762 1.056179 0.154306
C  2.890928 -0.08736 0.036046
C  2.224822 -1.343878 -0.165577
C  -3.670079 0.707807 -0.185911
C  -2.239717 -2.458605 0.855112
C  4.399622 -0.031702 0.116407
H  -3.021077 -1.491341 -0.941164
H  -1.44175 -2.232517 -1.182497
H  0.324795 3.125049 0.367279
H  0.3991 -2.444323 -0.394973
H  -2.1715 2.92987 0.228982
H  2.556692 2.036023 0.313622
H  2.831112 -2.252612 -0.253602
H  -4.094917 -0.053004 0.491594
H  -4.110272 1.678978 0.084962
H  -4.008158 0.470513 -1.212691
H  -1.279466 -2.66764 1.355537
H  -2.725198 -3.423987 0.630841
H  -2.884284 -1.91468 1.566996
H  4.766367 0.994442 0.27815
H  4.776633 -0.661741 0.943071
H  4.86038 -0.41417 -0.8131
