program: Gaussian 09
title: 000200202
version: EM64L-G09RevD.01
frameworkgroup: C1[X(C18H30N2O)]
method: RPBEPBE
basis: SDD
operation: Freq
keyword: #p
keyword: freq=noraman
keyword: PBEPBE/SDD
title: #p freq=noraman PBEPBE/SDD
converged: YES YES NO NO
title: Mulliken charges:
elementType: O N N C C C C C C C C C C C C C C C C C C H H H H H H H H H H H H H H H H H H H H H H H H H H H H H H
charge: -0.289334 -0.083928 -0.128795 0.359280 -0.601569 -0.251180 0.588446 -0.546446 -0.460743 0.267239 0.166937 -0.497875 -0.308356 -0.293255 -0.407845 -0.693769 -0.698290 -0.653653 -0.842732 -0.687495 -0.697686 0.233095 0.275261 0.205766 0.264950 0.230853 0.220585 0.233297 0.187133 0.242410 0.183009 0.209943 0.225559 0.224549 0.208539 0.223537 0.217142 0.211250 0.222334 0.297123 0.214779 0.235737 0.231721 0.223840 0.235208 0.224807 0.206943 0.214514 0.222330 0.216143 0.218692
chargesum: 0.00000
title: Mulliken charges with hydrogens summed into heavy atoms:
elementType: O N N C C C C C C C C C C C C C C C C C C
charge: -0.289334 -0.083928 -0.128795 0.359280 -0.093213 -0.045414 0.588446 -0.281497 -0.009305 0.267239 0.166937 -0.264578 0.121187 0.099696 -0.182287 -0.037143 -0.047564 0.093986 -0.151963 -0.041231 -0.040520
polarizability: 2.40795379e+02 9.03611145e-01 2.25049062e+02 -1.33703975e+01 8.39645451e+00 1.73288996e+02
1716.lowfreq: -11.2823 -4.3320 -0.0008 -0.0007 -0.0003 4.5318 15.6971 21.4104 29.7410
frequency: 13.8575 20.7341 29.4800 31.2209 38.4283 40.1408 77.3911 80.5501 90.9650 97.9517 142.3670 152.8471 160.2894 166.5438 172.2383 202.4633 209.4663 215.1955 228.6818 242.8217 248.0784 251.4112 281.9706 289.7793 315.9159 318.5709 370.6075 380.4129 397.5773 407.1764 431.8967 448.8708 452.9212 462.6418 496.2413 531.9190 560.1162 589.9434 638.2034 655.1767 681.6864 729.0984 751.7390 760.3231 783.0172 797.4645 801.0160 833.7593 869.3509 901.9816 911.7058 918.0720 926.8534 945.2672 952.7318 958.4974 980.6634 993.6195 995.5950 1000.9669 1042.2528 1064.5843 1069.3604 1073.9866 1087.2781 1106.0809 1113.2664 1115.4086 1123.3776 1137.1574 1142.6925 1156.7769 1179.7154 1190.2111 1195.0445 1218.3156 1239.4831 1246.3271 1266.1283 1279.7567 1288.5998 1290.6431 1309.5954 1328.8556 1345.1723 1354.3044 1366.5623 1375.9892 1377.0076 1380.4479 1387.6554 1390.1291 1395.0302 1398.2331 1402.7946 1416.1157 1425.2712 1457.8283 1463.2880 1466.0241 1466.3502 1468.2565 1468.8926 1472.7051 1476.4290 1477.1169 1478.5075 1480.9615 1482.8926 1485.5579 1488.4068 1492.8551 1499.7887 1501.9993 1573.2894 1583.2561 1621.7063 2853.3945 2871.5801 2918.2658 2960.8937 2971.5262 2972.8812 2975.5934 2977.7470 2984.5479 2986.2530 3010.1804 3029.1990 3039.6241 3041.2041 3044.0965 3046.5017 3066.7884 3068.6545 3073.2861 3074.7072 3078.1304 3079.9758 3080.3665 3081.0002 3087.5506 3090.9999 3094.2959 3108.0199 3117.6613 3133.1545
redmass: 3.4461 3.2158 3.0053 2.8233 4.0042 3.1744 2.2539 2.9540 2.7392 2.9876 3.0591 3.2965 1.0819 1.1539 2.1327 1.6139 1.1921 2.0932 1.3144 1.5567 3.2545 1.7637 2.7424 2.0967 2.6939 2.4445 2.7101 3.3085 2.6442 2.1465 2.9231 3.2925 2.7826 3.0557 3.4197 2.9834 3.8621 4.2319 4.5171 5.1867 3.6336 2.9539 3.2282 2.7094 2.9561 1.3850 1.2245 1.3790 2.8962 2.0217 1.7817 1.1853 2.0880 2.0271 1.4537 1.4266 2.2034 2.1448 1.5608 2.0911 1.5497 2.4842 1.6148 1.9318 2.0883 1.9344 2.5471 1.7035 1.5172 1.9610 1.9255 1.8547 1.6386 2.6376 2.3640 1.8366 1.5002 2.7689 1.5503 1.1555 1.1724 1.3849 1.3228 2.2197 1.3679 1.4182 1.3313 1.1976 1.3095 3.2901 1.2414 1.2564 1.2217 1.3737 1.7670 2.3226 1.3712 1.0951 1.0772 1.0445 1.0573 1.0512 1.0515 1.0510 1.0540 1.0663 1.0625 1.1001 1.1067 1.1433 1.1337 1.0859 1.1374 1.9795 5.9475 6.1670 6.3413 1.0724 1.0717 1.0675 1.0352 1.0377 1.0348 1.0561 1.0621 1.0358 1.0355 1.0584 1.0904 1.0887 1.0993 1.0875 1.0974 1.1000 1.1029 1.0995 1.1004 1.0982 1.0980 1.0975 1.0996 1.1003 1.1003 1.1004 1.0866 1.0912 1.0966
irintensity: 0.2767 0.3326 0.2255 1.2501 1.7023 0.2876 4.0193 0.4226 4.0412 2.0998 0.7442 0.9698 0.0659 0.0891 0.8437 1.9251 0.3800 0.1489 1.5840 0.7792 7.7207 3.4451 0.1666 0.9513 3.2317 1.5979 4.2273 2.2287 1.7153 3.2571 1.3625 1.3766 2.1993 1.0512 16.8633 4.1167 9.0894 9.7943 3.8663 7.2984 5.0827 4.2456 0.5711 18.5581 6.7773 4.8904 6.3023 25.5778 1.1024 0.6704 12.2441 2.5109 3.7255 15.6179 0.4605 1.3859 6.3450 20.9960 7.8204 15.8414 6.6573 39.6801 15.6101 23.7449 9.1353 33.0614 1.6724 12.3457 4.7052 4.1035 31.7403 26.4222 5.6432 8.1949 24.2445 3.8249 7.9996 1.8717 54.6074 6.9644 11.2552 19.1882 0.6355 3.1094 1.3562 7.9152 6.7157 14.8255 0.2149 3.2484 22.3645 21.6649 11.3467 25.9723 18.4879 9.3149 12.6969 32.6761 18.3553 2.4294 4.8236 2.8729 1.7330 10.6952 2.5878 7.9800 25.7423 3.4748 23.9844 5.4065 8.7753 7.6076 31.1379 25.9408 205.4457 16.5711 4.7452 70.9736 130.6024 66.3455 54.6721 40.0420 31.0775 28.9918 25.1792 26.1266 28.5438 36.4493 21.8451 4.3424 29.5436 11.4790 21.7143 6.7420 12.4557 89.4855 35.1893 35.9993 31.4020 70.0296 40.1632 38.1748 48.2815 6.6488 15.0111 8.6917 33.6930
temp: 298.150 k
press: 1.00000 atm
elementType: 8 7 7 6 6 6 6 6 6 6 6 6 6 6 6 6 6 6 6 6 6 1 1 1 1 1 1 1 1 1 1 1 1 1 1 1 1 1 1 1 1 1 1 1 1 1 1 1 1 1 1
symmnumber: 1
zpe: 1169590.6 jmol-1
zpe.correction: 0.445474 hartree
zpe.thermalcorrener: 0.470395 hartree
zpe.thermalcorrenthalpy: 0.471340 hartree
zpe.thermalcorrgfe: 0.387823 hartree
zpe.sumelectzpe: -886.988973 hartree
zpe.sumelectthermal: -886.964051 hartree
zpe.sumelectthermalent: -886.963107 hartree
zpe.sumelectthermalfe: -887.046623 hartree
dipole: 1.2734 1.0445 3.0570
dipole: 3.4724
quadrupole: -117.5123 -122.2224 -137.5713
quadrupole: -0.9613 0.2897 -3.2083
quadrupole: 8.2563 3.5463 -11.8026 -0.9613 0.2897 -3.2083
hfenergy: -887.4344465 hartree
pointgroup: C01 [X(C18H30N2O1)]
dipole: 0.4140014 -0.9739376 -0.8639326 debye
polarizability: 241.3881047|3.5101312|219.7206514|11.3676591|-17.8533167|178.0246808 unknown
InChI: InChI=1S/C18H30N2O/c1-7-20(8-2)13-18(21)19(6)12-17-11-16(14(3)4)10-9-15(17)5/h9-11,14H,7-8,12-13H2,1-6H3
charge 0 multiplicity 1
51 atoms
O  1.180584 1.742934 1.482756
N  0.812397 -0.361336 0.552749
N  3.78096 0.147227 -0.248102
C  -1.687027 -0.482561 0.773535
C  -0.331735 -0.592137 1.473861
C  -3.626669 2.324186 -1.082229
C  -3.266177 0.966946 -0.471929
C  -2.035046 0.763215 0.196564
C  2.644037 1.103077 -0.360794
C  -2.595233 -1.580005 0.69304
C  1.495807 0.842404 0.632595
C  -4.160958 -0.128301 -0.550213
C  4.404834 0.200503 1.108746
C  4.779383 0.364016 -1.33523
C  -3.828312 -1.374601 0.023767
C  -3.721925 3.430357 0.002766
C  -2.627447 2.735364 -2.196915
C  1.047941 -1.38513 -0.480294
C  -2.288261 -2.941699 1.301174
C  5.239531 -1.051002 1.436395
C  4.287061 -0.080917 -2.725819
H  -0.200904 -1.585307 1.938789
H  -0.249414 0.179763 2.259693
H  -4.627596 2.224076 -1.549521
H  -1.318973 1.589468 0.29024
H  2.959296 2.155376 -0.171778
H  2.245725 1.05182 -1.391504
H  -5.124332 -0.004121 -1.060824
H  5.029965 1.12131 1.225511
H  3.58876 0.285557 1.848257
H  5.099387 1.437198 -1.374719
H  5.678032 -0.224878 -1.080018
H  -4.53883 -2.207462 -0.048329
H  -4.463781 3.166267 0.777861
H  -4.019554 4.394897 -0.449734
H  -2.747625 3.577442 0.504315
H  -1.609561 2.867298 -1.78505
H  -2.931633 3.693917 -2.657445
H  -2.576512 1.968578 -2.991181
H  2.069537 -1.277357 -0.875537
H  0.96414 -2.388905 -0.022759
H  0.298717 -1.314959 -1.293104
H  -3.105471 -3.652632 1.090592
H  -1.355821 -3.379106 0.895901
H  -2.171438 -2.88825 2.400287
H  4.620573 -1.959351 1.331484
H  6.120322 -1.157723 0.777888
H  5.609766 -0.996597 2.476856
H  3.985754 -1.143428 -2.706778
H  3.428657 0.516738 -3.081927
H  5.097665 0.035929 -3.468387
