program: Gaussian 09
title: 000200152
version: EM64L-G09RevD.01
frameworkgroup: C1[X(C15H20NO)]
method: RPBEPBE
basis: SDD
operation: Freq
keyword: #p
keyword: freq=noraman
keyword: PBEPBE/SDD
title: #p freq=noraman PBEPBE/SDD
converged: YES YES NO NO
title: Mulliken charges:
elementType: O N C C C C C C C C C C C C C C C H H H H H H H H H H H H H H H H H H H H
charge: -0.239805 -0.166333 0.233249 0.284085 0.327403 0.382552 -0.402661 -0.470337 -0.317926 -0.528071 0.345832 -0.791445 -0.378495 -0.792916 -0.644298 -0.256790 -0.670194 0.255486 0.268601 0.263091 0.259782 0.287541 0.269516 0.269036 0.263369 0.277156 0.261463 0.261617 0.252874 0.233550 0.256970 0.247241 0.225308 0.224146 0.227714 0.240735 0.240955
chargesum: 1.00000
title: Mulliken charges with hydrogens summed into heavy atoms:
elementType: O N C C C C C C C C C C C C C C C
charge: -0.239805 -0.166333 0.233249 0.284085 0.327403 0.382552 0.121427 -0.207246 -0.058144 -0.240531 0.345832 0.010476 -0.101339 -0.016963 0.093463 0.192664 0.039209
polarizability: 2.78197292e+02 1.09020813e+01 1.89426144e+02 -2.33837913e+00 5.10943703e+00 9.54800318e+01
1716.lowfreq: -5.5209 -0.0006 0.0000 0.0007 0.4061 5.9123 42.5381 66.5624 84.7778
frequency: 42.5012 66.5354 84.7666 97.5285 107.1856 124.8462 164.0598 168.4901 198.0800 201.3252 207.8592 220.1881 244.8477 248.9709 267.1116 317.1380 342.7310 378.3060 409.4441 416.4034 431.4722 477.6869 515.5143 529.8357 539.8528 551.3140 615.5925 624.2422 660.2864 682.7465 718.0266 758.9821 787.4744 813.1545 819.8591 830.4650 878.7534 891.8568 896.5747 954.0149 955.4826 966.2110 987.4928 1020.2468 1030.2697 1041.2399 1042.5141 1066.8210 1075.7852 1094.5127 1117.0097 1130.0860 1136.1999 1189.9705 1210.5654 1230.0897 1250.1621 1264.2561 1291.5254 1305.1628 1344.9990 1356.9748 1362.9161 1383.3609 1395.2104 1400.8537 1404.3948 1406.9794 1410.4257 1434.6989 1456.5057 1462.5141 1463.0713 1467.4515 1470.2347 1472.9154 1473.7791 1482.4191 1486.1342 1487.1999 1513.8398 1525.1319 1564.6535 1599.4591 1629.0701 2975.1539 2987.8066 2990.9759 3002.8572 3005.8423 3041.9838 3063.3566 3065.7258 3072.1880 3097.2789 3103.3281 3106.0936 3113.3945 3117.4097 3120.1412 3130.0271 3171.7755 3177.0615 3184.6788 3193.6566
redmass: 3.4526 2.9357 3.5157 2.1234 2.7693 3.0634 2.9240 1.1877 1.2934 1.8213 1.3051 1.8427 1.2772 3.4281 3.4625 3.1379 4.2592 3.6212 3.0412 3.8128 2.9213 3.6512 4.8795 5.4930 2.8353 2.9624 4.7045 4.7331 3.1631 3.6010 5.5998 3.3624 1.2649 1.4168 3.0914 1.2247 1.3007 2.8856 1.5018 2.0325 1.8577 2.2979 1.9427 2.4527 1.5725 1.6046 1.5903 2.1610 3.4296 2.3147 2.2386 1.4190 1.7529 1.5346 2.0685 1.8304 1.5822 1.1473 1.6765 1.7129 1.4437 2.6820 1.4055 3.2526 1.9636 1.2586 1.4335 1.2550 1.2922 5.5590 2.0096 1.0386 1.0447 1.0788 1.1870 1.0875 1.0496 1.1540 1.1899 1.2039 3.1494 1.1061 5.6509 5.8879 6.2684 1.0554 1.0393 1.0415 1.0365 1.0368 1.1089 1.0963 1.0658 1.0947 1.0989 1.0989 1.0998 1.0986 1.1021 1.0981 1.1015 1.0886 1.0933 1.0919 1.0954
irintensity: 0.9323 0.0055 1.6886 3.4396 1.1511 0.4115 2.2568 1.8236 0.3795 0.3498 0.0747 0.3120 0.5814 0.5941 0.1689 2.3259 2.4078 0.1144 2.9052 0.7971 3.0411 2.6864 8.7981 0.8852 1.6723 0.1166 10.3818 2.0651 5.4438 2.1391 3.9022 0.3170 3.1038 41.8424 25.7514 3.4104 0.0465 3.3013 35.2433 14.1981 13.5468 5.1980 0.3107 110.1754 3.0122 13.1577 2.0066 12.2419 4.8215 39.6630 3.2426 6.2694 0.1202 66.6469 169.1583 5.9158 79.2174 0.2901 148.2690 24.8095 36.6856 13.0800 13.3065 0.9364 59.3370 25.5692 5.4417 30.7799 19.0048 11.3396 76.3933 13.8187 20.5854 27.1986 19.1138 14.1758 23.5501 13.0848 8.1174 9.6572 116.9725 20.5586 90.9839 93.0792 148.5692 30.7903 0.3011 1.3493 6.8255 11.5326 22.5733 2.9409 10.6928 2.8688 7.7003 16.5242 14.8762 12.3430 24.4377 7.2407 9.4309 2.4355 1.4847 0.5475 2.7272
temp: 298.150 k
press: 1.00000 atm
elementType: 8 7 6 6 6 6 6 6 6 6 6 6 6 6 6 6 6 1 1 1 1 1 1 1 1 1 1 1 1 1 1 1 1 1 1 1 1
symmnumber: 1
zpe: 830612.4 jmol-1
zpe.correction: 0.316364 hartree
zpe.thermalcorrener: 0.333561 hartree
zpe.thermalcorrenthalpy: 0.334506 hartree
zpe.thermalcorrgfe: 0.272201 hartree
zpe.sumelectzpe: -712.104835 hartree
zpe.sumelectthermal: -712.087637 hartree
zpe.sumelectthermalent: -712.086693 hartree
zpe.sumelectthermalfe: -712.148997 hartree
dipole: 4.2155 -1.6807 -0.4103
dipole: 4.5567
quadrupole: -40.2793 -71.4886 -101.3427
quadrupole: 4.4177 -0.8635 1.9608
quadrupole: 30.7576 -0.4517 -30.3058 4.4177 -0.8635 1.9608
hfenergy: -712.4211984 hartree
pointgroup: C01 [X(C15H20N1O1)]
dipole: -1.6502416 -0.6911403 0.1137844 debye
polarizability: 278.5507235|-9.3401122|189.2638864|1.3198494|-3.4672147|95.2888576 unknown
InChI: InChI=1S/C15H20NO/c1-5-16-12(4)9-11(3)14-10-13(17-6-2)7-8-15(14)16/h7-10H,5-6H2,1-4H3
charge 1 multiplicity 1
37 atoms
O  3.495572 0.323378 0.110169
N  -2.065588 -0.662089 0.264526
C  -0.666789 -0.456178 0.218927
C  -0.145241 0.889655 0.096066
C  -2.945471 0.389217 0.166318
C  -1.07103 1.998274 0.005073
C  -2.592548 -2.067388 0.382055
C  -2.439617 1.709764 0.03767
C  0.251638 -1.543011 0.293253
C  1.25965 1.090208 0.064913
C  2.153878 0.008277 0.147897
C  -4.43604 0.153323 0.205814
C  1.630844 -1.32155 0.261065
C  -0.586478 3.419302 -0.125102
C  -2.64855 -2.790383 -0.978162
C  4.512093 -0.769597 0.200009
C  5.878551 -0.100818 0.12881
H  -1.959466 -2.606935 1.103407
H  -3.594492 -2.014702 0.830034
H  -3.167958 2.520862 -0.034476
H  -0.095664 -2.574515 0.371033
H  1.676089 2.096154 -0.023762
H  -4.773639 -0.188381 1.202864
H  -4.962207 1.094892 -0.010428
H  -4.769649 -0.593597 -0.535638
H  2.304157 -2.180541 0.322116
H  0.049035 3.705068 0.733865
H  0.028092 3.551009 -1.035278
H  -1.426963 4.128207 -0.177026
H  -3.319453 -2.272392 -1.684946
H  -3.03777 -3.81258 -0.830728
H  -1.653765 -2.867024 -1.447719
H  4.369266 -1.306793 1.158211
H  4.355513 -1.469246 -0.644565
H  6.67065 -0.868278 0.189673
H  6.000498 0.44757 -0.819888
H  6.016551 0.605544 0.964049
