program: Gaussian 09
title: 000200167
version: EM64L-G09RevD.01
frameworkgroup: C1[X(C21H11FN4)]
method: RPBEPBE
basis: SDD
operation: Freq
keyword: #p
keyword: freq=noraman
keyword: PBEPBE/SDD
title: #p freq=noraman PBEPBE/SDD
converged: NO YES NO YES
title: Mulliken charges:
elementType: F N N N N C C C C C C C C C C C C C C C C C C C C C H H H H H H H H H H H
charge: -0.199082 -0.353272 -0.033857 -0.039874 -0.037731 0.077455 0.079657 0.074132 0.190527 0.149909 0.149777 0.074761 0.087407 0.084867 -0.499044 -0.337243 -0.336951 -0.329810 -0.360198 -0.361435 0.337879 -0.246102 -0.244987 -0.360026 -0.210784 -0.210948 0.303481 0.278492 0.279509 0.266758 0.263037 0.261950 0.234504 0.234659 0.262078 0.235521 0.234984
chargesum: 0.00000
title: Mulliken charges with hydrogens summed into heavy atoms:
elementType: F N N N N C C C C C C C C C C C C C C C C C C C C C
charge: -0.199082 -0.353272 -0.033857 -0.039874 -0.037731 0.077455 0.079657 0.074132 0.190527 0.149909 0.149777 0.074761 0.087407 0.084867 -0.195563 -0.058750 -0.057442 -0.063053 -0.097161 -0.099485 0.337879 -0.011599 -0.010328 -0.097948 0.024736 0.024036
polarizability: 4.15118901e+02 1.95244098e+00 4.10071782e+02 -3.34670763e-03 -3.72075387e-05 9.15820562e+01
1716.lowfreq: -7.9835 -0.0012 0.0004 0.0014 2.3638 4.3043 45.8941 56.5506 63.5969
frequency: 45.8890 56.5473 63.5952 96.4100 131.5362 147.6527 160.4563 167.4404 218.5190 260.0313 284.1259 285.6060 312.3745 324.6413 334.2974 366.6283 382.1721 418.5391 440.0803 441.8719 490.8167 494.5105 526.1496 531.4431 536.7728 543.9369 569.0819 575.9940 594.6853 620.4530 648.4555 665.3393 665.4881 670.8471 676.3678 705.2791 763.1061 765.4170 769.9845 781.8231 782.3055 799.1967 810.6843 816.8890 833.8669 883.4238 894.4681 895.3821 897.7404 914.2964 937.0680 961.0641 978.5856 979.4372 1002.3840 1002.8515 1004.2323 1022.2465 1033.2396 1075.2944 1083.4323 1105.8755 1124.2661 1131.2415 1157.0789 1166.2765 1170.1923 1208.6055 1213.8743 1219.0937 1241.2467 1251.9408 1269.1024 1296.5068 1313.8788 1317.0999 1380.4909 1396.3562 1399.1247 1430.6579 1446.7664 1450.3386 1462.3183 1469.0793 1473.9089 1489.1994 1560.9370 1562.0888 1566.1490 1581.4248 1583.9303 1618.4543 1619.0594 1623.3207 3136.9825 3137.6395 3153.6217 3153.8124 3164.9624 3169.1606 3169.2297 3177.1526 3177.3499 3183.4597 3185.1989
redmass: 7.3584 4.8954 5.8312 4.2919 7.6791 6.4709 5.2445 5.4832 7.6891 8.0378 5.9227 9.1998 5.5535 7.2166 7.5414 6.6711 5.7408 5.9366 3.4102 3.3912 4.0002 8.8615 3.5535 8.2112 8.3065 3.6114 3.9113 8.3696 7.6452 8.5888 7.3117 5.1727 6.7616 7.8646 6.6650 4.9654 3.7666 7.2535 4.1143 1.3658 1.3670 4.3659 6.4947 7.2811 1.5882 7.0479 1.4835 1.4694 7.9222 1.4614 6.0801 1.3420 1.3698 1.3712 1.3349 1.3350 3.8959 2.1493 1.9576 3.0305 3.6298 1.6409 1.6638 1.9348 2.5805 1.1336 1.1813 3.2473 2.7060 2.6134 2.5938 1.8011 2.0818 2.8604 3.0882 2.4275 7.5780 10.5628 10.1494 3.8118 2.5509 2.7478 4.1606 3.3144 3.6420 7.5077 7.5090 7.1425 8.0127 9.0451 9.3827 7.5158 7.4679 7.6679 1.0864 1.0864 1.0907 1.0906 1.0887 1.0951 1.0951 1.0995 1.0992 1.0951 1.0958
irintensity: 0.0085 0.0012 2.5286 0.0490 0.0465 1.5732 0.5856 0.0000 1.4905 0.9077 0.1513 7.6712 0.5692 0.6520 0.5145 1.1531 1.0963 3.3565 0.0268 0.3831 14.5600 13.6761 11.4318 4.0266 2.2874 0.0192 2.2188 4.7950 5.7862 0.0854 0.5890 0.0005 4.1402 0.3280 5.0814 2.7206 0.0022 32.2031 1.9318 122.3319 45.4319 0.6151 0.2646 3.7742 55.1892 3.6149 0.9460 0.0605 5.9789 23.3553 17.4009 0.7556 0.5266 6.3027 0.1116 0.0500 10.2211 12.5484 0.9147 5.5501 1.9703 5.7222 57.7634 75.3320 39.6308 1.6519 8.0258 28.4735 29.4163 4.2756 7.3060 46.4485 18.0187 0.8956 3.5577 1.5296 0.5702 28.5352 34.5856 10.0006 8.0201 19.8175 18.3061 102.4491 241.9735 4.3945 74.9551 39.9940 49.7823 381.9814 336.5891 29.2923 56.7833 50.2863 3.6273 3.6553 14.1424 12.9299 2.3909 4.3459 9.6948 33.7337 21.1802 0.0116 10.6453
temp: 298.150 k
press: 1.00000 atm
elementType: 9 7 7 7 7 6 6 6 6 6 6 6 6 6 6 6 6 6 6 6 6 6 6 6 6 6 1 1 1 1 1 1 1 1 1 1 1
symmnumber: 1
zpe: 701316.2 jmol-1
zpe.correction: 0.267117 hartree
zpe.thermalcorrener: 0.284699 hartree
zpe.thermalcorrenthalpy: 0.285643 hartree
zpe.thermalcorrgfe: 0.221919 hartree
zpe.sumelectzpe: -1124.023949 hartree
zpe.sumelectthermal: -1124.006367 hartree
zpe.sumelectthermalent: -1124.005422 hartree
zpe.sumelectthermalfe: -1124.069147 hartree
dipole: -2.3880 -0.5524 0.0000
dipole: 2.4510
quadrupole: -144.9526 -122.6584 -153.4329
quadrupole: -3.5131 -0.0001 0.0000
quadrupole: -4.6046 17.6895 -13.0849 -3.5131 -0.0001 0.0000
hfenergy: -1124.2910658 hartree
pointgroup: C01 [X(C21H11F1N4)]
dipole: 0.9381586 -0.2230831 0.000001 debye
polarizability: 415.0947928|-1.9832098|410.09589|-0.0033464|0.0000577|91.5820562 unknown
InChI: InChI=1S/C21H11FN4/c22-12-9-10-18-15(11-12)21-24-17-8-4-2-6-14(17)19-23-16-7-3-1-5-13(16)20(25-18)26(19)21/h1-11H
charge 0 multiplicity 1
37 atoms
F  -5.913924 0.01818 0.000127
N  0.23467 -0.002086 0.000057
N  -0.772384 -2.217293 0.00006
N  -1.181182 1.977944 0.000058
N  2.656772 0.234964 0.000035
C  -1.042803 0.660542 0.000067
C  0.303378 -1.44109 0.000055
C  1.447632 0.777512 0.000034
C  -2.221063 -0.211036 0.000079
C  1.646691 -2.024249 0.000045
C  1.27985 2.233259 0.000045
C  -2.042502 -1.63177 0.000079
C  -0.039219 2.789126 0.000053
C  2.787098 -1.159087 0.000034
C  -3.523366 0.349447 0.000093
C  1.825091 -3.432713 0.000043
C  2.410199 3.091796 0.000044
C  -3.187152 -2.477909 0.000101
C  -0.203526 4.200846 0.000061
C  4.09182 -1.723835 0.000017
C  -4.614181 -0.521733 0.000112
C  3.120442 -3.977221 0.000028
C  2.233673 4.485964 0.00005
C  -4.478898 -1.930125 0.000118
C  0.922624 5.040697 0.00006
C  4.256236 -3.118808 0.000012
H  -3.646537 1.435183 0.000087
H  0.933065 -4.065421 0.000056
H  3.404034 2.635413 0.000037
H  -3.027826 -3.559481 0.000102
H  -1.222348 4.59935 0.00007
H  4.94638 -1.04074 0.000007
H  3.256834 -5.063684 0.000027
H  3.10632 5.147446 0.000045
H  -5.372466 -2.560907 0.000137
H  0.79139 6.128177 0.000067
H  5.263775 -3.548657 -0.000001
