program: Gaussian 09
title: 000200160
version: EM64L-G09RevD.01
frameworkgroup: C1[X(C18H21NOS)]
method: RPBEPBE
basis: SDD
operation: Freq
keyword: #p
keyword: freq=noraman
keyword: PBEPBE/SDD
title: #p freq=noraman PBEPBE/SDD
converged: YES YES NO NO
title: Mulliken charges:
elementType: S O N C C C C C C C C C C C C C C C C C C H H H H H H H H H H H H H H H H H H H H H
charge: 0.156315 -0.276188 -0.090928 -0.332473 0.376381 0.617006 0.409217 -0.369410 -0.904337 -0.249363 -0.422970 -0.370039 -0.416770 -0.403322 -0.257418 -0.238179 -0.237474 -0.257254 -0.239078 -0.615033 -0.612793 0.195826 0.261708 0.328501 0.205579 0.203462 0.231655 0.225170 0.188810 0.222313 0.235020 0.241468 0.229731 0.229501 0.229806 0.230734 0.188187 0.223091 0.225437 0.228431 0.220807 0.188874
chargesum: 0.00000
title: Mulliken charges with hydrogens summed into heavy atoms:
elementType: S O N C C C C C C C C C C C C C C C C C C
charge: 0.156315 -0.276188 -0.090928 -0.136647 0.376381 0.617006 0.409217 -0.369410 -0.314128 0.159678 -0.191315 0.043941 -0.194457 -0.168302 -0.015950 -0.008449 -0.007972 -0.027448 -0.008344 0.021682 0.025318
polarizability: 2.16199970e+02 -3.56632021e+01 2.41155346e+02 7.90256287e+00 1.60828830e+01 2.01938899e+02
1716.lowfreq: -14.7213 -7.4423 -4.2787 0.0014 0.0018 0.0020 7.8379 23.6472 30.3765
frequency: -11.6935 23.5185 30.3524 46.4095 77.1545 84.6707 92.6646 122.2005 136.1172 146.2048 205.3270 217.2911 237.1731 242.8334 257.1581 263.9829 298.1440 315.0078 327.7583 356.3343 374.9837 396.0647 425.9033 447.2905 452.0940 464.7287 476.5831 521.1555 571.7164 579.3549 624.1385 646.0195 652.4134 671.5174 728.5381 752.4344 757.8079 768.2617 772.3916 809.8805 821.3795 845.3065 861.7881 867.8805 883.8387 913.2479 917.4546 947.4854 952.6006 980.1103 988.5652 990.2069 1029.6268 1031.3938 1033.5914 1040.8950 1055.9104 1065.7608 1087.9212 1094.7831 1101.4877 1126.0891 1138.6848 1163.7051 1167.4951 1169.1622 1176.0314 1181.0120 1212.6395 1228.2176 1235.6347 1252.4890 1261.5554 1264.7179 1282.0358 1288.0339 1306.9420 1337.9034 1344.3933 1376.1430 1387.8659 1394.8690 1419.1551 1420.9839 1436.7782 1441.7410 1442.8883 1461.2472 1465.5388 1466.5606 1473.9608 1476.2648 1484.3448 1485.6620 1489.8455 1571.6798 1592.5867 1599.4500 1610.9029 2847.7125 2854.2197 2871.5714 2944.7310 2950.6419 3005.3871 3019.8661 3029.1003 3034.5169 3050.9814 3079.2064 3086.5964 3112.9643 3114.2007 3115.7360 3121.8131 3124.4304 3140.4767 3142.6376 3162.3144 3164.1316
redmass: 2.7593 4.5766 4.9563 4.2958 4.1766 2.1216 2.8513 4.3469 4.5137 4.3150 2.5500 1.1570 3.9958 1.8383 3.7267 3.0179 4.5476 3.9767 3.3965 2.6980 3.6502 3.2365 3.8389 3.3489 3.1272 3.4198 3.7041 4.3324 4.4426 4.6923 5.8756 6.2827 5.5928 6.0768 3.6505 1.6887 1.8361 3.4627 1.7971 1.6193 2.1016 3.1782 1.4349 3.0264 1.7116 4.4947 2.1845 1.4737 1.4465 1.3328 3.9958 1.6466 3.1731 3.5995 1.5448 2.4077 2.3507 1.6269 1.4593 2.0572 1.9320 1.7726 1.4460 1.4784 1.4759 1.2027 1.0634 1.3525 2.4431 1.7470 1.6807 1.5956 1.2200 2.5151 1.4513 1.2318 1.2805 1.3484 2.0239 4.7449 1.4362 3.1878 1.1903 1.9257 1.1321 2.1744 1.1849 1.0481 1.0779 2.2210 1.0739 1.0552 1.1005 2.3094 1.0919 6.5530 6.5724 6.0970 6.4409 1.0572 1.0626 1.0647 1.0823 1.0563 1.1041 1.0727 1.0722 1.0580 1.0917 1.1008 1.1005 1.1070 1.0875 1.0875 1.0887 1.0879 1.0927 1.0931 1.1005 1.1008
irintensity: 0.2939 0.6717 0.1076 0.1945 1.0867 2.2220 0.7857 0.2537 1.1723 0.7597 0.3546 1.6935 2.8194 1.3197 4.4433 4.2211 0.8875 3.9989 7.5071 2.3440 0.2659 2.4469 4.7325 2.8277 0.0737 8.0023 7.1461 0.8500 0.6455 6.1672 12.9963 1.6730 22.7058 9.4312 6.1009 89.8437 18.1119 5.2770 51.6415 8.0734 7.7171 4.2299 0.2151 4.1449 1.5354 22.1678 6.1331 0.5337 2.7239 0.4709 150.9583 42.9990 65.8865 32.6423 14.9634 3.9432 2.3636 4.7856 10.5317 8.3911 2.4035 1.2842 2.9487 4.3082 10.7528 1.2262 0.4032 6.4701 14.3470 12.7584 1.4760 10.9799 3.7837 9.4474 5.0117 3.7314 6.3425 0.6492 2.7240 1.4960 2.2988 1.5728 6.9117 13.0171 9.3878 6.8270 3.4079 12.6874 5.7071 27.7309 16.5306 15.0185 12.2113 17.3677 6.5753 9.4840 0.5796 22.0450 0.5494 65.8681 97.9652 167.1329 24.3084 57.7764 24.2120 45.7703 46.7448 16.8605 27.4718 32.6783 50.3783 1.2517 5.0311 12.3202 2.9279 2.4026 21.7712 20.0761 36.3132 30.1837
temp: 298.150 k
press: 1.00000 atm
elementType: 16 8 7 6 6 6 6 6 6 6 6 6 6 6 6 6 6 6 6 6 6 1 1 1 1 1 1 1 1 1 1 1 1 1 1 1 1 1 1 1 1 1
symmnumber: 1
zpe: 906130.9 jmol-1
zpe.correction: 0.345127 hartree
zpe.thermalcorrener: 0.364340 hartree
zpe.thermalcorrenthalpy: 0.365285 hartree
zpe.thermalcorrgfe: 0.296541 hartree
zpe.sumelectzpe: -1224.972171 hartree
zpe.sumelectthermal: -1224.952958 hartree
zpe.sumelectthermalent: -1224.952014 hartree
zpe.sumelectthermalfe: -1225.020758 hartree
dipole: -1.8386 0.9699 -0.8791
dipole: 2.2570
quadrupole: -127.8576 -123.3462 -126.5714
quadrupole: -4.2085 -4.9668 3.3489
quadrupole: -1.9325 2.5788 -0.6463 -4.2085 -4.9668 3.3489
hfenergy: -1225.3172985 hartree
pointgroup: C01 [X(C18H21N1O1S1)]
dipole: -0.763921 -0.2624641 0.3688294 debye
polarizability: 227.0059576|38.0234218|230.6899815|-6.7254953|15.6545692|201.5982758 unknown
InChI: InChI=1S/C18H21NOS/c1-19(2)11-12-20-18-15-8-4-3-7-14(15)13-21-17-10-6-5-9-16(17)18/h3-10,18H,11-13H2,1-2H3
charge 0 multiplicity 1
42 atoms
S  2.079914 -0.633022 -2.199197
O  -0.669028 0.982746 -0.082483
N  -4.341732 1.718785 0.019403
C  0.333354 0.21761 0.716915
C  0.150404 -1.296335 0.595077
C  1.712807 0.772865 0.366675
C  0.102048 -1.947922 -0.671809
C  2.487591 0.482697 -0.795016
C  0.268231 -1.138401 -1.93043
C  -2.046598 0.817603 0.419714
C  0.014008 -2.0676 1.773308
C  -2.925825 1.759238 -0.416374
C  2.263452 1.680265 1.315327
C  -0.082892 -3.350296 -0.723908
C  3.767492 1.082903 -0.955804
C  -0.163074 -3.468501 1.71474
C  -0.215208 -4.112606 0.458385
C  3.527709 2.277217 1.155595
C  4.288953 1.96777 0.004913
C  -5.050092 0.495998 -0.413101
C  -5.082602 2.939374 -0.360211
H  0.155255 0.473428 1.784147
H  0.038024 -1.720155 -2.837672
H  -0.319498 -0.208326 -1.907097
H  -2.363577 -0.241054 0.322421
H  -2.102623 1.103474 1.491163
H  0.047074 -1.565113 2.748367
H  -2.544566 2.787124 -0.280127
H  -2.804029 1.506919 -1.500365
H  1.666761 1.918504 2.204684
H  -0.117347 -3.848027 -1.700628
H  4.352559 0.852645 -1.853954
H  -0.26459 -4.048777 2.638305
H  -0.358488 -5.197218 0.3992
H  3.912483 2.969155 1.91179
H  5.277678 2.414044 -0.148146
H  -5.132472 0.409697 -1.527285
H  -6.072035 0.494511 0.006309
H  -4.533234 -0.403864 -0.038755
H  -4.574576 3.828738 0.052528
H  -6.101628 2.900345 0.065616
H  -5.178984 3.077061 -1.467617
