program: Gaussian 09
title: 000200162
version: EM64L-G09RevD.01
frameworkgroup: C1[X(C20H25NOS)]
method: RPBEPBE
basis: SDD
operation: Freq
keyword: #p
keyword: freq=noraman
keyword: PBEPBE/SDD
title: #p freq=noraman PBEPBE/SDD
converged: YES YES NO NO
title: Mulliken charges:
elementType: S O N C C C C C C C C C C C C C C C C C C C C H H H H H H H H H H H H H H H H H H H H H H H H H
charge: 0.156353 -0.290761 -0.110360 -0.331697 0.387830 0.611986 -0.371269 0.406669 -0.228910 -0.370278 -0.906343 -0.321925 -0.341755 -0.426293 -0.416750 -0.403544 -0.257677 -0.238277 -0.237272 -0.257133 -0.673612 -0.678998 -0.239657 0.199849 0.201367 0.195743 0.194878 0.201106 0.262520 0.327902 0.205161 0.184844 0.269071 0.176472 0.232042 0.223740 0.235267 0.241761 0.229806 0.229625 0.230497 0.227311 0.203453 0.205956 0.221004 0.201137 0.208085 0.231078
chargesum: 0.00000
title: Mulliken charges with hydrogens summed into heavy atoms:
elementType: S O N C C C C C C C C C C C C C C C C C C C C
charge: 0.156353 -0.290761 -0.110360 -0.131849 0.387830 0.611986 0.025841 0.406669 0.167074 -0.370278 -0.315921 0.068079 0.103788 -0.194251 -0.193010 -0.168277 -0.015916 -0.008471 -0.007647 -0.026637 -0.036892 -0.048773 -0.008578
polarizability: 2.25977728e+02 -9.92510484e+00 2.86468136e+02 -2.15303950e+01 8.09516166e+00 2.14287035e+02
1716.lowfreq: -12.5146 -8.3369 -5.7501 -0.0013 0.0008 0.0009 8.9178 10.9961 29.7478
frequency: 6.1866 10.6975 29.6961 32.6936 54.8857 67.8702 82.9284 87.1641 102.5805 131.5612 141.4214 169.1065 191.2107 208.3692 216.4425 241.6105 258.3898 281.7599 292.7010 295.9641 306.1720 311.8185 334.9655 378.8215 400.8307 423.8848 430.5755 449.9760 460.7735 468.6739 510.6852 520.2995 568.0571 580.1433 624.1612 646.0031 650.9246 667.4468 705.2204 726.5802 751.1299 757.9250 767.3915 772.2430 792.3903 800.3802 826.4784 846.0454 862.5970 877.0416 883.3116 907.6408 912.7537 921.3727 941.5033 949.1224 954.7219 980.7248 990.0855 1011.5516 1023.5926 1030.7396 1040.8453 1056.0990 1064.1316 1074.9132 1083.3048 1094.6048 1101.3913 1117.0206 1126.5858 1166.2231 1168.6480 1170.7803 1176.0903 1181.0151 1201.7129 1211.5053 1219.9962 1228.3330 1251.3376 1262.2690 1277.3723 1281.5118 1292.3488 1294.1473 1310.5287 1342.9391 1360.0453 1369.8486 1373.8116 1377.9844 1380.7187 1384.8996 1389.2477 1394.0759 1420.0915 1435.3683 1441.0416 1447.9800 1461.4365 1462.2005 1467.5053 1470.0925 1474.0569 1479.0315 1485.4453 1486.6473 1490.0746 1571.6128 1592.4759 1599.7269 1610.6950 2845.7700 2855.2981 2876.2641 2939.0094 2946.5012 2979.0088 2979.5639 3004.0732 3033.9238 3035.9199 3036.8011 3058.3271 3070.9102 3078.7350 3087.6612 3089.5469 3114.5829 3115.1642 3117.7597 3122.3013 3124.9153 3140.5596 3143.2395 3162.3728 3164.6967
redmass: 3.8341 3.5502 4.7596 4.7189 4.3655 2.8708 2.1841 4.4139 2.3729 4.3167 3.9477 1.4999 2.0760 1.5952 3.1180 6.0845 4.5114 2.3859 2.0465 2.9414 3.5771 2.5765 3.9402 4.2395 3.7712 3.2833 3.6086 3.5883 2.5778 3.6500 2.6285 4.2583 4.1234 4.3978 5.5965 6.1981 5.4117 6.0839 2.8863 3.8941 1.6485 1.7730 3.5956 1.8121 1.1548 1.1479 2.7422 3.2955 1.5177 2.3663 1.6680 2.1689 2.6249 2.1733 2.3359 1.5421 1.6965 1.3300 1.3325 2.1638 2.7647 6.0665 2.3982 2.3679 1.9926 2.0239 2.1696 2.3787 1.9421 2.0105 1.7826 1.6626 1.3428 1.5744 1.0655 1.3099 1.7914 2.4150 1.4485 1.5874 1.6092 1.2213 1.1541 1.4282 1.1958 1.2476 1.2443 1.9152 1.3092 1.4872 1.7777 2.4853 1.2376 1.2433 1.3012 3.3477 2.0516 1.1502 2.1715 1.0842 1.0784 1.0654 2.2599 1.0533 1.0493 1.0469 2.5943 1.0734 1.0772 6.5565 6.5902 6.0865 6.4300 1.0723 1.0718 1.0704 1.0572 1.0826 1.0356 1.0357 1.1057 1.0862 1.0859 1.0602 1.0933 1.0978 1.0945 1.0992 1.1001 1.0877 1.1066 1.0872 1.0887 1.0882 1.0928 1.0932 1.1005 1.1008
irintensity: 0.2429 0.1087 0.1632 0.1695 0.2147 0.4506 0.0114 0.7388 0.7296 0.2125 2.0654 2.5858 0.6731 0.3480 0.1411 3.9280 9.4400 0.3350 1.7159 2.1332 2.3043 2.2391 1.5302 1.1964 0.9209 2.5718 5.3507 2.8944 2.5609 10.7535 8.8337 0.5379 0.1857 2.3930 12.1397 3.8257 21.9578 12.7516 5.7597 2.5408 98.6543 16.8025 3.3038 46.3016 5.9195 6.9320 4.5374 5.5850 1.3023 4.5699 1.7253 8.0997 7.8003 13.5620 94.6905 14.7223 18.0559 0.3547 0.1402 41.0642 74.4892 37.1223 2.2975 3.9200 13.0915 13.8101 1.5044 11.9596 2.7332 10.8269 3.4555 8.3798 7.2842 5.7628 0.3873 5.8120 19.8198 12.8982 12.7359 8.1213 11.7129 3.7207 10.5060 8.6978 15.8676 23.2925 13.4071 2.7717 10.8441 1.1782 0.7466 1.9390 9.1639 23.5948 10.8243 0.9913 16.7859 7.9060 8.2675 4.8591 3.5915 12.6729 28.0348 13.1782 6.8272 3.0451 12.4490 5.8380 14.8654 9.6343 0.5412 21.1574 0.4407 41.6634 127.5079 117.7523 40.9999 33.3866 35.9065 28.9752 40.9997 9.1045 29.7728 21.7329 18.7973 69.2951 34.3092 39.0796 38.8219 6.5293 1.2701 9.7707 2.8752 2.5694 21.9473 19.9604 36.6674 28.7634
temp: 298.150 k
press: 1.00000 atm
elementType: 16 8 7 6 6 6 6 6 6 6 6 6 6 6 6 6 6 6 6 6 6 6 6 1 1 1 1 1 1 1 1 1 1 1 1 1 1 1 1 1 1 1 1 1 1 1 1 1
symmnumber: 1
zpe: 1052562.3 jmol-1
zpe.correction: 0.400900 hartree
zpe.thermalcorrener: 0.423735 hartree
zpe.thermalcorrenthalpy: 0.424679 hartree
zpe.thermalcorrgfe: 0.344739 hartree
zpe.sumelectzpe: -1303.420931 hartree
zpe.sumelectthermal: -1303.398096 hartree
zpe.sumelectthermalent: -1303.397152 hartree
zpe.sumelectthermalfe: -1303.477092 hartree
dipole: -0.7433 -1.8118 0.7626
dipole: 2.1016
quadrupole: -146.0693 -132.9084 -139.4585
quadrupole: -2.2092 1.3242 3.4357
quadrupole: -6.5906 6.5703 0.0203 -2.2092 1.3242 3.4357
hfenergy: -1303.8218311 hartree
pointgroup: C01[X(C20H25N1O1S1)]
dipole: 0.465213 0.6829003 0.0296137 debye
polarizability: 227.1653458|9.8675724|269.52756|15.8133565|-34.9399021|230.0399928 unknown
InChI: InChI=1S/C20H25NOS/c1-3-21(4-2)13-14-22-20-17-10-6-5-9-16(17)15-23-19-12-8-7-11-18(19)20/h5-12,20H,3-4,13-15H2,1-2H3
charge 0 multiplicity 1
48 atoms
S  -2.774676 -0.78188 -1.594091
O  0.768261 -0.128533 -0.27491
N  3.819848 -0.858998 -0.256782
C  -0.31548 0.391499 0.611308
C  -0.96925 1.660237 0.060367
C  -1.244361 -0.779892 0.927314
C  3.068556 0.097791 -1.106161
C  -1.508019 1.718849 -1.257877
C  1.913212 0.80195 -0.384581
C  -2.267615 -1.316944 0.091262
C  -1.469734 0.4915 -2.12895
C  5.251628 -0.966181 -0.649872
C  3.150474 -2.189828 -0.14871
C  -1.026976 2.811729 0.880364
C  -1.047237 -1.387825 2.199481
C  -2.08724 2.925416 -1.718487
C  -3.057465 -2.405451 0.555726
C  -1.61305 4.011404 0.417478
C  -2.143111 4.069159 -0.890836
C  -1.824658 -2.467578 2.657679
C  6.096465 0.239965 -0.194734
C  3.533229 -2.945809 1.137896
C  -2.846837 -2.976362 1.823607
H  0.167762 0.67581 1.571104
H  2.671954 -0.37897 -2.037357
H  3.767157 0.89142 -1.430735
H  1.598353 1.703636 -0.95301
H  2.244546 1.110015 0.629373
H  -1.749193 0.707769 -3.172744
H  -0.495259 -0.01748 -2.086038
H  5.659289 -1.876355 -0.174583
H  5.364136 -1.112651 -1.75519
H  2.063112 -2.009159 -0.147335
H  3.377285 -2.825468 -1.042732
H  -0.608761 2.768482 1.89397
H  -0.250707 -0.990329 2.840599
H  -2.502355 2.964617 -2.73287
H  -3.840465 -2.809334 -0.096824
H  -1.650693 4.89166 1.068446
H  -2.594209 4.995347 -1.263759
H  -1.638755 -2.903632 3.644539
H  6.029559 0.355346 0.901148
H  5.756449 1.185092 -0.657042
H  7.157448 0.097191 -0.473885
H  3.26434 -2.34358 2.023568
H  4.615348 -3.166777 1.191662
H  2.992056 -3.909199 1.189006
H  -3.471461 -3.814171 2.152298
