program: Gaussian 09
title: 000200226
version: EM64L-G09RevD.01
frameworkgroup: C1[X(C21H28N2O2)]
method: RPBEPBE
basis: SDD
operation: Freq
keyword: #p
keyword: freq=noraman
keyword: PBEPBE/SDD
title: #p freq=noraman PBEPBE/SDD
converged: NO YES NO NO
title: Mulliken charges:
elementType: O O N N C C C C C C C C C C C C C C C C C C C C C H H H H H H H H H H H H H H H H H H H H H H H H H H H H
charge: -0.477320 -0.265457 -0.104132 -0.103310 -0.111400 -0.407033 -0.349893 0.151071 0.398776 0.383719 -0.336322 -0.327626 -0.664143 -0.357610 -0.422888 -0.375142 -0.322586 -0.673807 -0.672986 -0.248497 -0.228861 -0.225485 -0.258201 -0.245766 -0.242840 0.230018 0.247641 0.233849 0.193914 0.237314 0.189988 0.206275 0.188143 0.222332 0.242104 0.305766 0.235532 0.255613 0.268796 0.243622 0.357625 0.204387 0.224653 0.207722 0.205576 0.228216 0.206494 0.226810 0.222362 0.224668 0.223903 0.227783 0.226634
chargesum: 0.00000
title: Mulliken charges with hydrogens summed into heavy atoms:
elementType: O O N N C C C C C C C C C C C C C C C C C C C C C
charge: -0.119695 -0.265457 -0.104132 -0.103310 -0.111400 0.070625 0.077870 0.151071 0.398776 0.383719 0.090980 0.066792 0.106059 -0.122078 -0.167275 -0.106347 -0.078964 -0.037044 -0.032699 -0.021687 -0.006499 -0.000817 -0.034298 -0.017983 -0.016206
polarizability: 2.59604593e+02 5.33866747e+00 2.57210438e+02 -9.77617688e+00 4.89928397e+00 2.15836219e+02
1716.lowfreq: -11.8912 -3.6787 -0.0007 -0.0003 0.0010 4.8899 13.3714 18.1808 26.0156
frequency: 8.7019 17.7487 25.8228 36.6723 49.9420 61.9333 66.1815 69.9232 72.6886 79.3813 98.7026 135.5093 160.5725 167.3702 176.2747 204.9865 211.1534 232.8727 250.7905 257.8630 266.4109 283.5502 288.4355 295.1212 316.3551 347.4327 364.2941 390.3819 395.8848 401.6607 406.6434 421.1730 443.2869 447.8652 467.3710 475.3483 534.6749 547.5647 614.2384 616.0116 617.5502 643.6429 679.3504 699.4338 710.7357 714.6930 739.8338 751.6892 769.7842 779.2044 793.9908 801.0679 846.6752 857.2674 860.1503 884.6171 913.0982 921.3690 931.9108 967.5384 973.4334 981.8705 988.6080 989.4473 989.6667 992.4718 994.7790 997.5684 1027.5931 1031.6648 1034.0001 1049.7140 1072.0993 1077.2998 1082.3246 1084.1047 1092.8879 1100.9490 1119.8787 1130.9557 1151.3247 1158.2335 1172.2386 1173.0999 1189.5348 1194.6371 1197.3223 1205.7093 1219.9663 1260.2373 1280.2735 1290.6195 1292.8945 1301.2011 1318.3201 1323.3258 1329.1347 1362.0516 1373.2643 1376.6381 1380.1671 1382.8586 1384.2363 1385.7216 1387.0222 1430.2216 1437.1517 1440.7615 1442.3859 1461.5679 1463.5293 1472.3342 1476.5703 1479.3516 1479.8121 1481.3602 1481.9517 1488.1196 1490.9867 1494.1892 1562.2738 1588.9527 1593.3318 1607.7242 1612.0732 2853.9370 2866.6191 2908.0730 2976.5621 2980.1274 2980.8139 3023.3670 3029.2283 3032.6664 3034.0272 3054.6387 3071.6025 3073.7411 3088.6897 3090.0895 3093.9129 3120.3973 3122.1005 3128.6753 3133.4076 3140.5220 3141.6540 3147.8904 3157.9526 3160.5254 3170.2833 3185.8026 3554.6779
redmass: 3.3644 4.2203 4.2742 3.6937 4.7324 4.5976 3.2884 3.9110 2.9336 2.4610 3.4290 2.7252 1.4008 2.7051 1.9511 2.3731 1.3340 2.5187 3.9461 2.6970 3.3307 3.0935 2.1905 2.9742 3.4954 2.7616 4.0864 2.1425 2.7181 2.7740 3.1038 2.0908 3.6947 3.1871 2.8190 3.4100 3.7368 3.9044 5.9492 6.3566 5.6493 5.8689 6.0922 1.8551 1.8333 6.5419 2.2816 1.7918 2.0399 1.2637 1.1356 1.2848 1.2536 1.8242 2.0557 2.9410 1.9784 1.5649 1.5860 4.5512 1.4246 1.4022 4.4625 5.1892 2.5148 1.7791 2.2986 1.3814 2.2091 2.2539 2.7171 1.9375 2.6830 1.8445 1.5871 2.1570 1.7737 1.7289 1.3241 1.8799 2.0198 1.9933 1.0575 1.0601 1.2327 2.8506 1.1335 2.3602 2.9135 1.7925 1.1628 1.2160 1.7157 1.2575 1.3645 1.3198 1.3094 1.3275 1.3265 6.4663 1.5128 4.5885 1.9917 1.4838 1.2499 2.1823 2.2178 1.1417 1.2180 1.0559 1.0564 1.0541 1.8655 1.2828 1.0473 1.0718 2.0733 1.0721 1.0793 1.0620 5.7351 6.2356 6.2806 6.0827 6.0416 1.0720 1.0714 1.0691 1.0382 1.0357 1.0356 1.0602 1.0867 1.0886 1.0905 1.1006 1.0984 1.0980 1.1003 1.1002 1.1053 1.0855 1.0846 1.0877 1.0890 1.0966 1.0935 1.0934 1.0969 1.0991 1.0979 1.0947 1.0658
irintensity: 0.0947 0.1914 0.0142 0.3913 0.4821 2.4594 0.2440 0.8436 0.1380 0.4471 0.8877 1.2083 0.0715 1.6777 2.3931 1.4126 0.0727 0.4725 0.4663 1.7175 1.4612 2.7726 2.4439 6.2402 3.5202 34.1412 1.9506 79.5099 18.4503 3.0681 8.9437 82.3235 3.1454 16.2733 3.9456 2.9898 10.3195 13.6118 6.3400 0.1280 17.2764 38.3496 4.1207 29.4837 93.9991 2.0455 7.7747 37.7871 51.1375 6.4245 4.3614 5.1365 1.5444 5.7540 11.5952 21.6911 1.4609 6.4758 2.9091 34.5049 0.9580 0.0184 12.1136 0.7636 6.4198 7.5447 13.9352 2.4226 8.2754 1.6906 11.6448 40.2766 32.0218 22.5367 0.6824 2.3625 3.0453 14.3527 3.6500 42.3590 19.0479 70.5880 0.4564 0.6985 1.7418 2.1234 2.2011 23.3032 35.4955 32.9307 19.6540 12.3600 25.6954 24.2482 4.3045 12.1900 1.5978 4.1056 4.7721 1.7311 12.0102 7.9355 48.4192 5.0642 23.2201 4.3576 25.8500 6.8115 8.6002 4.0787 2.5227 3.2569 32.9101 20.5443 4.8643 9.9505 18.2949 10.3360 11.2074 28.8313 214.7460 10.5395 0.6301 8.4565 2.8977 58.4135 129.4470 69.7610 46.4625 38.9096 29.8490 30.0433 3.2679 19.3360 22.7613 38.8247 43.2792 80.3584 41.1294 42.4403 14.0160 5.5590 0.2621 3.0287 12.6818 0.1506 31.4276 22.9556 20.6987 39.1405 12.2055 4.3016 10.0216
temp: 298.150 k
press: 1.00000 atm
elementType: 8 8 7 7 6 6 6 6 6 6 6 6 6 6 6 6 6 6 6 6 6 6 6 6 6 1 1 1 1 1 1 1 1 1 1 1 1 1 1 1 1 1 1 1 1 1 1 1 1 1 1 1 1
symmnumber: 1
zpe: 1171146.3 jmol-1
zpe.correction: 0.446066 hartree
zpe.thermalcorrener: 0.471980 hartree
zpe.thermalcorrenthalpy: 0.472924 hartree
zpe.thermalcorrgfe: 0.386837 hartree
zpe.sumelectzpe: -1075.081510 hartree
zpe.sumelectthermal: -1075.055596 hartree
zpe.sumelectthermalent: -1075.054652 hartree
zpe.sumelectthermalfe: -1075.140738 hartree
dipole: -0.5800 -1.6843 -1.1583
dipole: 2.1248
quadrupole: -143.9663 -145.2932 -141.0113
quadrupole: -0.2404 1.9286 -1.6176
quadrupole: -0.5427 -1.8696 2.4123 -0.2404 1.9286 -1.6176
hfenergy: -1075.5275757 hartree
pointgroup: C01 [X(C21H28N2O2)]
dipole: 0.1755044 0.0984047 -0.8113772 debye
polarizability: 257.3843617|12.939267|230.64441|3.5380318|-19.8694307|244.622479 unknown
InChI: InChI=1S/C21H28N2O2/c1-4-23(5-2)17-16-22(3)20(24)21(25,18-12-8-6-9-13-18)19-14-10-7-11-15-19/h6-15,25H,4-5,16-17H2,1-3H3
charge 0 multiplicity 1
53 atoms
O  -1.046204 -1.695821 -1.351467
O  0.759552 -0.560003 1.351539
N  1.000297 0.392321 -0.740038
N  4.722296 0.181819 0.047358
C  -1.187015 -0.778793 -0.191404
C  2.351483 0.849626 -0.330008
C  3.434728 -0.235962 -0.556039
C  0.262732 -0.299926 0.205415
C  -2.073914 0.393906 -0.651345
C  -1.908033 -1.511006 0.965416
C  4.794495 -0.146432 1.500217
C  5.91569 -0.267605 -0.715798
C  0.593712 0.712536 -2.123585
C  -2.019167 1.636059 0.027293
C  -2.710009 -2.641403 0.666218
C  -2.999858 0.223879 -1.708448
C  -1.86931 -1.036906 2.30158
C  5.711879 0.810002 2.285124
C  6.147085 0.550503 -2.000651
C  -2.877039 2.693401 -0.34589
C  -3.438533 -3.300966 1.681811
C  -3.855821 1.283141 -2.083132
C  -2.599001 -1.695247 3.314116
C  -3.800223 2.521939 -1.403354
C  -3.38358 -2.832541 3.012766
H  2.608021 1.756857 -0.904857
H  2.320801 1.109561 0.740803
H  3.064697 -1.197869 -0.130356
H  3.574475 -0.391575 -1.641993
H  3.770598 -0.085107 1.912704
H  5.126725 -1.203765 1.655481
H  6.796915 -0.145567 -0.059788
H  5.857554 -1.357778 -0.965398
H  1.473291 0.605842 -2.784335
H  0.218689 1.750942 -2.198404
H  -0.181917 0.018376 -2.470493
H  -1.307775 1.782942 0.848821
H  -2.782057 -2.992815 -0.368401
H  -3.034702 -0.733686 -2.235932
H  -1.252142 -0.173401 2.558355
H  -0.590286 -2.516099 -1.031173
H  6.754097 0.777396 1.917667
H  5.350886 1.848754 2.187526
H  5.725847 0.538027 3.357274
H  5.299646 0.460247 -2.705204
H  6.268627 1.618983 -1.751233
H  7.055909 0.201022 -2.525677
H  -2.824835 3.648999 0.187979
H  -4.052047 -4.173573 1.429977
H  -4.567534 1.140382 -2.904336
H  -2.549479 -1.321156 4.342928
H  -4.466608 3.342127 -1.692975
H  -3.946939 -3.341688 3.802939
