program: Gaussian 09
title: 000200199
version: EM64L-G09RevD.01
frameworkgroup: C1[X(C27H29NO)]
method: RPBEPBE
basis: SDD
operation: Freq
keyword: #p
keyword: freq=noraman
keyword: PBEPBE/SDD
title: #p freq=noraman PBEPBE/SDD
converged: YES YES NO NO
title: Mulliken charges:
elementType: O N C C C C C C C C C C C C C C C C C C C C C C C C C C C H H H H H H H H H H H H H H H H H H H H H H H H H H H H H
charge: -0.268722 -0.110004 -0.701333 0.151533 0.071696 0.289888 0.123647 0.300624 0.291214 -0.429899 -0.394264 -0.390998 -0.395305 -0.242875 -0.246829 -0.405223 -0.381323 -0.376375 -0.293662 0.341221 -0.326243 -0.330864 -0.357015 -0.393910 -0.240530 -0.252470 -0.671093 -0.668614 -0.252880 0.253102 0.230911 0.241973 0.260782 0.253694 0.257523 0.218492 0.222272 0.223418 0.223586 0.260400 0.220784 0.208264 0.223372 0.190716 0.205671 0.192736 0.208213 0.250604 0.249232 0.226534 0.222771 0.208022 0.226836 0.210652 0.208265 0.225248 0.208786 0.227750
chargesum: 0.00000
title: Mulliken charges with hydrogens summed into heavy atoms:
elementType: O N C C C C C C C C C C C C C C C C C C C C C C C C C C C
charge: -0.268722 -0.110004 -0.217320 0.151533 0.071696 0.289888 0.123647 0.300624 0.291214 -0.187926 -0.133482 -0.137304 -0.137783 -0.019458 -0.023243 0.035541 -0.120923 -0.155591 0.137975 0.341221 0.070144 0.070085 -0.106411 -0.144678 -0.013996 -0.029699 -0.025584 -0.026315 -0.025130
polarizability: 4.01769782e+02 2.12239868e+01 3.89997738e+02 -3.16972557e+01 1.67101203e+01 2.03822876e+02
1716.lowfreq: -4.5327 -2.9074 -0.0010 -0.0005 0.0008 3.6836 10.2390 18.1283 27.7897
frequency: 9.7659 17.9986 27.7682 36.8860 44.2908 56.3682 58.4794 71.2374 73.1703 87.9174 97.9539 101.1107 138.2863 155.8679 171.8378 179.3027 180.3408 202.0444 220.1057 247.6349 261.4312 273.0611 282.2893 295.7615 313.0156 333.6448 355.2998 378.4749 389.6980 403.9149 414.7418 425.2628 439.3090 477.5755 480.3165 499.4984 513.6642 528.6007 549.5872 584.9277 600.5974 615.5302 623.0039 641.1599 656.6315 677.2810 699.2577 724.0734 735.6317 742.1191 768.3461 775.3563 790.6303 795.3310 797.8940 802.4886 815.4536 829.5151 841.5040 848.3628 867.9689 872.2351 912.4429 915.6436 926.8724 933.4146 949.6699 955.7338 969.0865 970.1065 975.8912 985.1483 986.9805 990.6794 993.7604 1004.8392 1015.6814 1024.4930 1044.0906 1062.5977 1063.5415 1076.9332 1084.7596 1084.8636 1094.2496 1100.3778 1116.0205 1122.8108 1123.5388 1161.9417 1167.3203 1172.0798 1176.0224 1179.3684 1194.3386 1199.8168 1207.9292 1213.4879 1226.8750 1237.2379 1260.4754 1278.3187 1289.0794 1292.2691 1293.2626 1305.5753 1320.4179 1327.9237 1347.9935 1361.9688 1363.1202 1367.2528 1374.1429 1387.4492 1387.5880 1390.3368 1399.4424 1416.1569 1419.8845 1434.8359 1448.7424 1460.2594 1460.3845 1464.3238 1470.7314 1471.6759 1481.0545 1482.3000 1485.4860 1487.7989 1493.5545 1499.5621 1565.4426 1572.8804 1583.8452 1594.3757 1608.0993 1616.2022 1620.9086 2856.7634 2865.6257 2919.4496 2965.1503 2973.4091 2980.9119 2984.1605 3019.7286 3021.1791 3030.1182 3036.1582 3061.9578 3073.9987 3076.7981 3090.5232 3091.4648 3119.8189 3121.0766 3129.4676 3129.8095 3135.0681 3140.8655 3142.9359 3145.8999 3156.8994 3160.7166 3163.5786 3167.9216 3169.1759
redmass: 4.3041 3.5461 4.4263 4.0501 3.6657 3.8947 4.2323 3.8754 3.4195 2.3155 3.0931 3.7681 2.6688 3.4743 2.9725 2.8368 3.1199 2.1888 1.4551 2.2547 2.9737 2.4530 3.9146 2.4531 3.1059 4.9531 4.2629 3.2525 3.7118 2.8490 3.0187 3.0586 2.8579 2.7675 3.6036 3.6510 3.1897 3.0819 4.3344 6.5616 4.6868 6.4380 5.6203 5.9263 4.5912 5.9316 1.7264 3.0268 2.0315 3.0749 1.8342 2.1046 1.3609 1.1835 1.8509 2.8441 1.9159 1.3001 1.7217 1.2562 1.9794 2.2460 1.5226 1.8733 1.7365 6.2239 1.3842 1.6065 1.3846 6.4506 1.3911 1.3115 5.9268 2.2440 1.3160 2.6038 3.1705 2.2855 2.1424 1.7096 2.6144 1.9028 1.7379 2.1393 2.8008 1.8659 1.3408 1.1694 1.7076 1.3886 1.1036 1.1461 2.0484 1.4309 1.3340 1.2469 2.2283 2.4302 2.9317 1.6777 3.1446 1.1204 1.2085 1.6194 1.2473 1.4016 1.4940 1.3541 3.4591 2.5727 1.5078 1.4551 6.3102 1.3696 1.2590 1.2690 4.0799 1.6637 2.1287 2.3753 2.4737 2.6567 1.1011 1.0541 1.0886 1.0783 1.5273 1.3028 1.1077 1.0873 1.0885 2.4860 6.9298 6.1583 6.7522 7.9456 6.0348 7.0515 6.5196 1.0720 1.0714 1.0699 1.0565 1.0620 1.0358 1.0358 1.0881 1.0967 1.1017 1.0878 1.0961 1.0982 1.0983 1.1004 1.1004 1.0858 1.0844 1.0878 1.0893 1.0889 1.0884 1.0934 1.0936 1.0967 1.0998 1.0954 1.0956 1.0985
irintensity: 0.0768 0.1386 0.0804 0.2869 0.0536 0.1251 0.3644 0.1078 0.1305 0.3052 0.1194 0.0279 1.2806 1.4912 0.9581 0.2855 0.6035 2.2914 0.8332 5.2094 4.0744 0.3264 0.8257 2.2816 1.5236 1.3311 0.6441 3.2204 4.1664 0.1052 0.8119 2.7737 3.5027 2.5667 5.6975 7.3512 11.4753 2.1647 12.8063 19.0783 15.2704 1.5405 2.1345 7.8400 2.1751 1.5590 54.3413 5.4606 24.9574 7.2748 85.2625 19.0370 4.7838 3.5203 16.5591 1.8234 13.7310 1.9526 43.2265 1.0525 3.7724 2.6339 2.5904 0.3960 1.2379 19.4747 1.1877 3.2308 2.0130 123.6253 0.5875 0.0717 0.4481 6.7423 0.5543 6.7762 3.0673 15.2577 3.5633 32.6519 29.7995 18.8070 7.2101 2.9556 15.4190 2.2579 11.8960 4.0968 8.5966 11.5601 3.8592 2.4240 31.0247 105.6650 2.6364 1.9618 37.4053 2.0617 306.4210 24.0204 5.0653 0.2437 10.1722 11.5054 26.3079 0.4208 6.2988 3.4314 2.8258 34.8751 13.3976 0.5606 2.1435 6.8618 17.7415 22.0717 12.7066 10.1017 1.4534 6.4938 2.0156 13.5379 6.0298 14.7710 13.8637 27.3343 46.8033 10.0316 17.4051 17.3994 3.1883 110.7133 17.3364 1.1578 7.9547 1.1877 16.2172 12.3643 104.8752 32.9859 187.9753 64.2646 39.2843 17.5136 28.8988 30.8674 20.6730 8.1035 15.7910 15.9755 39.2673 59.4360 68.1773 31.1500 55.7250 3.5121 5.1841 2.3439 10.3986 14.7116 13.2115 32.5891 26.6967 41.1214 35.9895 15.5254 6.3332 12.8793
temp: 298.150 k
press: 1.00000 atm
elementType: 8 7 6 6 6 6 6 6 6 6 6 6 6 6 6 6 6 6 6 6 6 6 6 6 6 6 6 6 6 1 1 1 1 1 1 1 1 1 1 1 1 1 1 1 1 1 1 1 1 1 1 1 1 1 1 1 1 1
symmnumber: 1
zpe: 1270046.6 jmol-1
zpe.correction: 0.483735 hartree
zpe.thermalcorrener: 0.510896 hartree
zpe.thermalcorrenthalpy: 0.511840 hartree
zpe.thermalcorrgfe: 0.422643 hartree
zpe.sumelectzpe: -1174.147342 hartree
zpe.sumelectthermal: -1174.120181 hartree
zpe.sumelectthermalent: -1174.119237 hartree
zpe.sumelectthermalfe: -1174.208435 hartree
dipole: 1.9550 0.5392 0.8510
dipole: 2.1993
quadrupole: -144.2904 -164.3736 -173.1111
quadrupole: -2.8383 -4.5729 2.0833
quadrupole: 16.3013 -3.7819 -12.5194 -2.8383 -4.5729 2.0833
hfenergy: -1174.6310776 hartree
pointgroup: C01 [X(C27H29N1O1)]
dipole: 0.7881172 0.1389872 0.329039 debye
polarizability: 403.94912|21.7855663|384.9022823|-32.4928486|26.4886712|206.7389931 unknown
InChI: InChI=1S/C27H29NO/c1-3-28(4-2)18-19-29-24-16-14-22(15-17-24)27-25-13-9-8-12-23(25)20-26(27)21-10-6-5-7-11-21/h5-17H,3-4,18-20H2,1-2H3
charge 0 multiplicity 1
58 atoms
O  3.033205 -1.141204 -1.11401
N  6.533307 -0.748274 0.126167
C  -4.651794 0.703462 0.587422
C  -3.18048 0.996573 0.279996
C  -2.520002 -0.191523 -0.022887
C  -4.773956 -0.792553 0.383214
C  -3.491692 -1.309677 0.028401
C  -1.074093 -0.404154 -0.292176
C  -2.673837 2.384083 0.267935
C  -5.882768 -1.642957 0.518963
C  -3.314881 -2.698733 -0.17411
C  -0.082294 0.075515 0.602198
C  -0.639826 -1.13056 -1.438403
C  -5.709365 -3.033916 0.296375
C  -4.434891 -3.55321 -0.041925
C  5.429348 -1.082987 -0.807023
C  -1.595477 2.794644 -0.572554
C  -3.301945 3.383186 1.069929
C  4.085586 -0.662125 -0.197373
C  1.70006 -0.861968 -0.78262
C  7.742908 -0.206459 -0.54664
C  6.827469 -1.847275 1.086085
C  1.291901 -0.14417 0.370729
C  0.726072 -1.352317 -1.688353
C  -1.156846 4.133464 -0.591153
C  -2.859809 4.722715 1.054023
C  7.553928 1.241194 -1.03807
C  7.435709 -1.347309 2.410451
C  -1.78069 5.10728 0.225492
H  -5.323241 1.283242 -0.076076
H  -4.920352 0.985564 1.626146
H  -6.867143 -1.246451 0.794382
H  -2.329002 -3.108979 -0.416754
H  -0.394674 0.627965 1.494858
H  -1.382922 -1.501384 -2.153271
H  5.393772 -2.168493 -1.055732
H  5.566939 -0.544303 -1.760804
H  -6.564116 -3.712885 0.393024
H  -4.315944 -4.631488 -0.198604
H  -1.114285 2.061306 -1.225975
H  -4.137586 3.106612 1.722869
H  3.945585 -1.116483 0.80497
H  4.040391 0.4399 -0.098161
H  8.063775 -0.857214 -1.399252
H  8.569513 -0.222689 0.186517
H  7.498662 -2.617358 0.628013
H  5.873839 -2.362016 1.309077
H  2.02456 0.239557 1.08661
H  1.061051 -1.900489 -2.574317
H  -0.330927 4.420926 -1.251842
H  -3.357284 5.465894 1.687698
H  8.48133 1.61359 -1.512056
H  7.299321 1.899395 -0.18917
H  6.74309 1.319654 -1.785179
H  7.618619 -2.195925 3.09587
H  6.74823 -0.63642 2.901102
H  8.400499 -0.832037 2.252756
H  -1.436747 6.147467 0.209322
