program: Gaussian 09
title: 000200127
version: EM64L-G09RevD.01
frameworkgroup: C1[X(C13H12N2)]
method: RPBEPBE
basis: SDD
operation: Freq
keyword: #pfreq=noraman
keyword: PBEPBE/SDD
title: #p freq=noraman PBEPBE/SDD
converged: YES YES NO NO
title: Mulliken charges:
elementType: N N C C C C C C C C C C C C C H H H H H H H H H H H H
charge: -0.134602 -0.660282 0.302603 0.112056 0.258236 -0.360484 -0.368755 -0.226262 -0.240597 -0.416821 -0.389998 -0.231539 -0.211737 -0.203271 -0.260319 0.279794 0.221352 0.229785 0.227343 0.261548 0.246925 0.230701 0.222255 0.223234 0.226250 0.316283 0.346303
chargesum: 0.00000
title: Mulliken charges with hydrogens summed into heavy atoms:
elementType: N N C C C C C C C C C C C C C
charge: -0.134602 0.002304 0.302603 0.112056 0.258236 -0.080690 -0.147403 0.003523 -0.013254 -0.155273 -0.143074 -0.000838 0.010518 0.019963 -0.034069
polarizability: 2.71959985e+02 4.68034759e+00 1.46239924e+02 1.50210476e+00 5.66732238e+00 7.48020364e+01
1716.lowfreq: -12.7732 -5.3573 -0.0007 -0.0007 -0.0004 2.7962 32.9129 48.7243 60.2604
frequency: 32.8318 48.7116 60.2510 97.9321 150.8367 194.5406 257.9263 289.6644 360.1373 404.8614 406.0493 429.7031 456.6526 477.0947 516.7909 548.3079 560.1102 611.8562 615.9077 644.6784 672.6765 699.4617 700.8135 746.4325 780.8358 785.2038 799.3400 842.8575 855.2338 903.9106 933.3999 967.0511 981.4602 983.1215 984.1257 989.8701 1004.3085 1017.8505 1023.9491 1042.3669 1075.3095 1084.3650 1125.4829 1167.1833 1172.2911 1178.2295 1188.4481 1245.3728 1303.2606 1315.3617 1360.8231 1367.9012 1386.3797 1435.2650 1436.5265 1470.4205 1487.9950 1571.3933 1581.7338 1596.1463 1606.9527 1613.7423 1637.7084 3117.0700 3120.0114 3126.4821 3130.9086 3138.5708 3144.0485 3152.6101 3159.2661 3165.5720 3171.0260 3525.2413 3672.6760
redmass: 3.7206 4.7038 4.8904 4.8548 4.4375 4.8956 4.7681 4.3337 3.6928 2.8591 2.8630 1.6498 4.3033 1.9610 2.8742 3.9114 1.3429 6.3240 6.3043 5.0644 5.0874 1.9619 1.7271 2.3254 2.1802 2.5303 5.1156 1.2460 1.2488 1.4359 1.4330 1.3638 3.7203 1.4499 1.4532 5.1343 1.3435 2.4927 2.3389 1.8934 1.5578 1.6349 2.2153 1.0570 1.0614 1.1196 1.1139 3.7501 1.4520 1.3354 3.4752 5.3090 9.1060 2.2552 2.4810 2.2483 2.5535 5.9439 5.0743 3.1238 3.2450 6.1647 2.1113 1.0851 1.0861 1.0870 1.0875 1.0937 1.0929 1.0950 1.0966 1.1009 1.0990 1.0455 1.1026
irintensity: 0.0604 0.1888 2.5341 3.6205 3.6708 0.7447 2.0222 0.8912 8.5884 0.4066 0.9755 74.3499 2.5124 64.6157 43.5473 17.3392 48.7646 1.6787 0.2172 7.5507 32.3594 19.5471 74.3334 42.3795 70.6731 12.8222 21.7870 1.7489 1.7336 5.4559 5.2374 0.5132 1.9771 1.3548 0.6058 0.0786 2.9460 14.3220 14.9633 23.9494 10.4803 14.3961 3.9681 0.5110 0.9785 3.8691 6.9473 43.4255 1.5825 6.0815 105.3790 4.5513 0.5782 14.3650 4.6976 31.6748 28.1713 10.4049 182.8331 180.7287 22.4908 0.8317 339.6662 9.0097 7.2894 2.8203 2.0157 23.4759 29.0203 31.8672 24.4367 24.1093 16.8957 20.3867 31.3658
temp: 298.150 k
press: 1.00000 atm
elementType: 7 7 6 6 6 6 6 6 6 6 6 6 6 6 6 1 1 1 1 1 1 1 1 1 1 1 1
symmnumber: 1
zpe: 567693.2 jmol-1
zpe.correction: 0.216223 hartree
zpe.thermalcorrener: 0.228713 hartree
zpe.thermalcorrenthalpy: 0.229658 hartree
zpe.thermalcorrgfe: 0.176163 hartree
zpe.sumelectzpe: -611.045874 hartree
zpe.sumelectthermal: -611.033383 hartree
zpe.sumelectthermalent: -611.032439 hartree
zpe.sumelectthermalfe: -611.085933 hartree
dipole: -1.3417 -2.3332 1.6005
dipole: 3.1314
quadrupole: -74.8233 -76.5496 -91.9357
quadrupole: -0.4432 1.0428 -0.4151
quadrupole: 6.2796 4.5533 -10.8328 -0.4432 1.0428 -0.4151
hfenergy: -611.2620964 hartree
pointgroup: C01 [X(C13H12N2)]
dipole: -0.5122028 0.986423 -0.5314132 debye
polarizability: 271.770753|-6.6023961|144.5120753|-1.9977237|12.8876789|76.7191174 unknown
InChI: InChI=1S/C13H12N2/c14-13(11-7-3-1-4-8-11)15-12-9-5-2-6-10-12/h1-10H,14H2
charge 0 multiplicity 1
27 atoms
N  0.441719 -0.453475 0.06554
N  -0.07325 1.761242 -0.722463
C  -1.881991 0.208313 -0.110746
C  -0.418572 0.497243 -0.245948
C  1.846578 -0.279138 0.032303
C  -2.311263 -1.143665 -0.059695
C  -2.852168 1.242547 -0.025911
C  -3.680658 -1.455346 0.055339
C  -4.224792 0.928691 0.090296
C  2.516107 0.775112 0.727354
C  2.636562 -1.255979 -0.640409
C  -4.644613 -0.420345 0.125656
C  3.926471 0.849056 0.730808
C  4.043117 -1.16346 -0.645871
C  4.699853 -0.110311 0.036938
H  -1.545783 -1.924002 -0.106676
H  -2.545692 2.295338 -0.004424
H  -3.999151 -2.503104 0.08901
H  -4.962859 1.7351 0.163911
H  1.928755 1.499974 1.304055
H  2.122886 -2.079542 -1.147129
H  -5.709436 -0.662869 0.214393
H  4.422032 1.656226 1.28331
H  4.631308 -1.921669 -1.175881
H  5.793404 -0.047714 0.03904
H  -0.769137 2.359457 -1.159883
H  0.911671 1.996919 -0.840516
