program: Gaussian 09
title: 000200250
version: EM64L-G09RevD.01
frameworkgroup: C1[X(C22H31NO3)]
method: RPBEPBE
basis: SDD
operation: Freq
keyword: #p
keyword: freq=noraman
keyword: PBEPBE/SDD
title: #p freq=noraman PBEPBE/SDD
converged: YES YES NO NO
title: Mulliken charges:
elementType: O O O N C C C C C C C C C C C C C C C C C C C C C C H H H H H H H H H H H H H H H H H H H H H H H H H H H H H H H
charge: -0.217286 -0.269223 -0.233537 -0.615800 0.437070 -0.144981 -0.130459 -0.111247 -0.318405 -0.541064 0.253834 -0.610683 -0.528079 -0.210362 -0.496059 -0.832578 0.511513 -0.632859 -0.510345 -0.816719 0.155717 0.179826 -0.553595 -0.560352 0.175803 -0.785812 0.256196 0.220557 0.222417 0.267077 0.220964 0.199093 0.224477 0.243593 0.228970 0.208327 0.266341 0.225950 0.224518 0.214322 0.214278 0.281539 0.225141 0.226771 0.211214 0.218172 0.226848 0.231801 0.224197 0.233158 0.241837 0.253234 0.247742 0.243196 0.252095 0.330945 0.320710
chargesum: 0.00000
title: Mulliken charges with hydrogens summed into heavy atoms:
elementType: O O O N C C C C C C C C C C C C C C C C C C C C C C
charge: -0.217286 -0.269223 -0.233537 0.035854 0.437070 0.111215 0.090098 0.111170 -0.051327 -0.121006 0.253834 -0.142614 -0.090781 0.055978 -0.045590 -0.122439 0.511513 -0.180947 -0.080959 -0.133872 0.155717 0.179826 -0.078600 -0.307117 0.175803 -0.042779
polarizability: 2.92840295e+02 -1.18536631e+01 2.21743984e+02 1.54748597e+01 3.35179629e+00 2.18051421e+02
1716.lowfreq: -9.5958 -7.4002 -5.9623 -2.1858 0.0003 0.0005 0.0007 28.3992 32.3631
frequency: -6.4164 28.3977 32.1953 56.9321 66.7369 74.1732 100.5692 112.9108 119.0157 126.5344 154.0078 169.2303 183.4692 192.5302 202.9197 218.4352 243.3638 247.3269 266.6190 273.6507 295.0874 298.2402 313.8947 319.4051 344.1161 360.7838 365.8203 380.0475 396.9161 410.9866 430.4293 447.0780 463.3594 489.4724 497.7699 522.5629 525.3183 534.2934 554.8560 576.6161 578.0667 597.5050 604.3648 607.7233 642.1590 648.7028 680.0516 720.1961 725.5623 755.9377 780.7275 804.3334 825.6954 840.4089 855.7487 868.8975 878.5437 889.0198 912.3844 920.3257 926.3332 935.1951 950.1177 958.5337 969.1180 977.6915 990.1801 998.6877 1013.7750 1018.1306 1026.5825 1030.7105 1043.7619 1052.3924 1063.0405 1068.6777 1075.3319 1100.1414 1109.4225 1112.0757 1115.7649 1125.2132 1143.3156 1152.8262 1169.9856 1173.8000 1181.2023 1182.9737 1197.2294 1208.0941 1208.7669 1229.6525 1233.7715 1236.4093 1254.2416 1270.2368 1276.3076 1279.9205 1288.5629 1295.8141 1311.2704 1313.6059 1318.6180 1321.9024 1327.9546 1332.2230 1340.1489 1341.1338 1342.9724 1347.2553 1353.8736 1365.5219 1371.5464 1380.5149 1388.7541 1401.0069 1441.6876 1443.6720 1452.5898 1460.7947 1463.5422 1465.8237 1468.0932 1471.9859 1474.1443 1478.6566 1485.2076 1488.1427 1498.8167 1586.4884 1590.4127 1614.7450 1624.2145 1633.5973 2928.5686 2931.0351 2960.2155 2966.0877 2975.4146 2976.3571 2980.3773 2981.3828 2982.1857 2985.5503 2988.3780 2990.9074 2999.9957 3000.8323 3020.1294 3023.9281 3037.1986 3042.6455 3049.7749 3055.3855 3064.5948 3065.5523 3065.6044 3069.0978 3071.0209 3087.1318 3090.6797 3118.2362 3120.4033 3514.4363 3670.6012
redmass: 5.2281 6.1933 5.4408 4.6521 4.8903 4.5859 4.6698 1.4396 3.7085 2.0870 2.7788 2.4246 1.2494 3.5071 2.1873 2.4968 1.8176 3.0721 2.6351 2.8949 2.8848 2.6284 2.9176 2.9656 2.8637 3.2037 3.0827 3.0523 2.7410 3.0606 2.8845 3.2640 3.2315 3.5732 2.7180 1.1842 2.6242 2.5021 3.4254 2.5576 2.1759 3.1766 1.9479 2.5076 3.3992 3.0072 3.4769 2.8971 4.0361 2.7981 2.5566 2.1054 2.2143 2.8083 2.5746 2.3266 2.5721 1.4232 1.9503 2.0215 1.7792 2.1520 1.9995 2.2928 1.9286 1.9267 1.8188 1.9217 1.9584 1.8684 2.2594 2.0353 2.0570 2.4785 2.2782 2.7457 2.8153 1.6538 1.9633 2.2161 2.0015 2.0807 1.6970 2.5126 1.6295 1.9916 1.6784 1.8425 1.6534 1.6218 1.6820 1.3647 1.6227 1.4979 1.5580 1.4461 2.0088 1.3494 1.2675 1.4444 1.3583 1.5620 1.4904 1.4735 1.4097 1.4812 1.4868 1.3011 1.8439 1.5338 1.4568 1.4946 1.2490 2.3448 1.2238 1.1947 1.0738 1.0820 1.0555 1.0823 1.0786 1.0893 1.0821 1.0805 1.0799 1.0694 1.0691 1.0685 1.0629 9.8549 1.6457 6.5164 7.6692 2.7714 1.0820 1.0798 1.0593 1.0684 1.0713 1.0678 1.0379 1.0412 1.0415 1.0603 1.0614 1.0603 1.0839 1.0609 1.0973 1.0863 1.0990 1.1005 1.0977 1.1018 1.1020 1.0953 1.0943 1.0982 1.0990 1.0983 1.0993 1.0911 1.1011 1.0447 1.1044
irintensity: 12.5638 2.1573 0.2815 4.9686 0.6956 5.7169 3.6361 1.2974 4.6458 1.1341 1.4692 2.2072 0.9038 2.4148 2.0641 0.6735 0.8260 0.9047 0.7818 3.4833 3.4034 0.5308 1.2135 1.5467 0.6821 3.1230 2.5159 0.3374 1.9353 0.1051 0.6065 1.6960 0.4052 1.6070 3.3329 133.8612 2.5088 9.9529 15.3242 38.0697 34.4401 2.6925 29.9751 17.1930 2.4863 2.4344 8.5807 3.8064 18.2345 2.3352 5.6667 0.2072 1.3253 3.0941 2.8379 2.3826 4.6313 19.7887 12.1740 0.7764 1.3947 4.1140 5.2076 4.7287 5.5666 15.0571 5.7265 2.2697 0.1542 3.5420 4.8752 3.9433 2.0831 2.1279 2.6420 1.9072 2.6880 8.5428 1.4748 6.6438 1.2568 19.3299 5.5485 1.2020 33.6889 31.6024 9.4405 16.4774 9.8785 4.7281 8.5677 7.1497 33.2156 20.1245 30.4664 16.1789 33.1118 7.6836 17.8942 16.7868 13.8195 46.2014 15.2824 5.4035 12.3328 7.7930 1.6428 4.2875 3.6878 4.6063 2.9399 15.7772 75.3006 134.5759 14.4109 30.2413 17.3492 14.0803 13.7170 5.7982 10.5832 9.1437 11.4273 3.0761 11.9021 14.4342 9.3858 7.0336 9.5840 175.9128 65.7778 110.7961 212.2184 222.8485 2.3967 10.6898 41.1696 16.6921 11.9200 12.7327 2.4410 25.3832 5.2540 8.5456 25.2048 86.8303 12.9290 19.1162 26.1823 25.0369 40.6173 35.9815 37.4470 37.4491 38.7970 25.4270 7.4726 29.1888 26.2145 36.9389 13.8909 9.8982 13.4499 39.0870 23.4209
temp: 298.150 k
press: 1.00000 atm
elementType: 8 8 8 7 6 6 6 6 6 6 6 6 6 6 6 6 6 6 6 6 6 6 6 6 6 6 1 1 1 1 1 1 1 1 1 1 1 1 1 1 1 1 1 1 1 1 1 1 1 1 1 1 1 1 1 1 1
symmnumber: 1
zpe: 1284137.6 jmol-1
zpe.correction: 0.489102 hartree
zpe.thermalcorrener: 0.513444 hartree
zpe.thermalcorrenthalpy: 0.514388 hartree
zpe.thermalcorrgfe: 0.436660 hartree
zpe.sumelectzpe: -1135.398849 hartree
zpe.sumelectthermal: -1135.374507 hartree
zpe.sumelectthermalent: -1135.373563 hartree
zpe.sumelectthermalfe: -1135.451291 hartree
dipole: 4.4507 -1.1504 2.0274
dipole: 5.0242
quadrupole: -186.5359 -146.6545 -166.1599
quadrupole: 3.0142 -31.9211 15.0388
quadrupole: -20.0858 19.7956 0.2902 3.0142 -31.9211 15.0388
hfenergy: -1135.8879514 hartree
pointgroup: C01 [X(C22H31N1O3)]
dipole: -1.7460536 0.5302224 0.7598419 debye
polarizability: 292.342749|-14.7178547|222.7012374|-14.0767398|-3.0714611|217.5917142 unknown
InChI: InChI=1S/C22H31NO3/c1-12(24)19-16(20(23)26)11-18-15-5-4-13-10-14(25)6-8-21(13,2)17(15)7-9-22(18,19)3/h10,15-19H,4-9,11,23H2,1-3H3
charge 0 multiplicity 1
57 atoms
O  -2.737047 -1.739382 -2.120098
O  -4.948987 1.580747 0.861001
O  5.828707 -0.799038 -1.96705
N  -5.310946 2.044096 -1.380409
C  -1.694795 -0.427214 0.767148
C  -0.958806 0.555525 -0.199797
C  0.42453 1.00583 0.320064
C  1.315395 -0.271152 0.504785
C  -3.094857 -0.602727 0.018563
C  -0.807078 -1.687262 0.928242
C  2.794591 0.095185 0.953129
C  -2.02857 1.618783 -0.519063
C  0.615326 -1.308662 1.4258
C  -3.305557 0.740648 -0.770244
C  1.081519 2.039131 -0.627699
C  -2.013919 0.186397 2.159436
C  3.312004 1.091577 -0.095491
C  2.539796 2.388524 -0.200847
C  3.739011 -1.145044 1.01886
C  2.814605 0.743689 2.371794
C  -3.118354 -1.815996 -0.917056
C  -4.583821 1.471018 -0.350606
C  4.197053 -1.673304 -0.355317
C  4.298516 0.784485 -0.999622
C  4.877672 -0.565201 -1.159547
C  -3.63863 -3.122951 -0.336525
H  -0.780001 -0.01066 -1.142288
H  0.289353 1.493521 1.307525
H  1.400769 -0.735619 -0.504297
H  -3.882679 -0.73094 0.783358
H  -0.711799 -2.209909 -0.045779
H  -1.258137 -2.403858 1.643638
H  -1.783799 2.231112 -1.4044
H  -2.18179 2.301245 0.337801
H  0.55528 -0.915815 2.45884
H  1.218583 -2.234241 1.476758
H  -3.335753 0.492329 -1.848423
H  0.475347 2.964561 -0.654156
H  1.101395 1.631169 -1.659305
H  -2.444868 -0.594236 2.81494
H  -1.117646 0.584431 2.665432
H  -2.764234 0.992036 2.085619
H  2.513955 2.926659 0.766286
H  3.001667 3.061645 -0.945284
H  3.261541 -1.953776 1.601084
H  4.64215 -0.847864 1.589341
H  2.607163 -0.022432 3.14093
H  3.813964 1.165393 2.584741
H  2.075145 1.552364 2.495871
H  3.331901 -2.038527 -0.946489
H  4.896862 -2.521171 -0.252879
H  4.650578 1.540649 -1.713739
H  -3.184871 -3.331823 0.648871
H  -4.730748 -3.036938 -0.171455
H  -3.444473 -3.957955 -1.027568
H  -6.149246 2.578556 -1.151562
H  -5.036161 1.939892 -2.35546
