program: Gaussian 09
title: 000200131
version: EM64L-G09RevD.01
frameworkgroup: C1[X(C22H14N4O)]
method: RPBEPBE
basis: SDD
operation: Freq
keyword: #p
keyword: freq=noraman
keyword: PBEPBE/SDD
title: #p freq=noraman PBEPBE/SDD
converged: YES YES YES YES
title: Mulliken charges:
elementType: O N N N N C C C C C C C C C C C C C C C C C C C C C C H H H H H H H H H H H H H H
charge: -0.255907 -0.353418 -0.040644 -0.043494 -0.040759 0.070649 0.067539 0.074939 0.156671 0.148696 0.147509 0.132272 0.087219 0.083644 -0.356114 -0.336784 -0.338011 -0.520546 -0.364765 -0.363267 0.358989 -0.372781 -0.247507 -0.248640 -0.211986 -0.211857 -0.536245 0.277249 0.279783 0.278425 0.283443 0.259695 0.260670 0.245635 0.232984 0.232470 0.232388 0.233099 0.224722 0.224722 0.249312
chargesum: 0.00000
title: Mulliken charges with hydrogens summed into heavy atoms:
elementType: O N N N N C C C C C C C C C C C C C C C C C C C C C C
charge: -0.255907 -0.353418 -0.040644 -0.043494 -0.040759 0.070649 0.067539 0.074939 0.156671 0.148696 0.147509 0.132272 0.087219 0.083644 -0.078865 -0.057001 -0.059585 -0.237103 -0.105071 -0.102597 0.358989 -0.127146 -0.014523 -0.016169 0.020402 0.021243 0.162511
polarizability: 4.81284147e+02 -3.25738701e+00 4.15094348e+02 -9.97797924e-03 -6.62678280e-03 1.02636213e+02
1716.lowfreq: -0.0012 -0.0006 0.0010 5.9754 11.0471 11.3290 44.8628 58.4552 63.5489
frequency: 44.8456 58.4304 63.5413 90.2488 97.5100 111.5414 147.3913 160.5722 169.2049 222.8560 227.1641 255.7978 271.7385 283.7594 287.0572 316.1134 318.8718 351.1011 353.4977 370.1506 439.2040 448.3930 464.8128 485.5951 516.5118 530.0320 539.5970 545.0477 557.5858 578.4332 592.6135 624.0758 624.6954 628.2928 664.5877 665.4800 670.8151 679.1625 705.3157 732.6175 761.6900 770.0909 780.8047 781.8115 797.5814 809.0801 826.1509 835.4919 889.1941 890.4418 892.2784 894.5181 896.9748 923.3158 977.7280 979.3302 979.6586 990.2541 1001.2198 1002.1725 1002.7366 1022.4938 1032.2925 1079.3266 1087.6524 1112.0366 1113.6503 1126.9576 1135.0056 1147.7415 1164.2881 1168.1988 1181.5451 1213.8109 1216.5874 1234.9122 1243.3642 1264.3817 1271.4354 1296.3274 1313.1386 1327.7519 1374.5777 1396.7798 1399.6438 1435.7499 1442.0341 1447.0556 1453.7782 1465.5296 1469.6614 1469.8850 1472.7658 1479.8158 1495.7404 1552.6675 1561.3405 1562.9909 1582.4707 1583.3350 1618.9149 1620.9706 1632.0049 2967.0404 3058.0469 3130.8308 3135.2217 3135.4214 3152.0214 3152.5122 3157.5174 3167.4485 3168.1991 3175.6343 3176.1602 3176.5656 3184.7425
redmass: 4.8887 4.5918 5.0634 4.2194 3.9359 4.8858 5.3692 5.1410 5.2306 1.5618 4.0435 2.5094 7.0852 7.5394 5.2870 5.3967 6.5234 6.4912 5.1015 5.6629 3.3698 3.2809 5.6919 3.4816 7.3731 3.6107 8.5368 3.6373 7.1845 7.1014 7.7296 4.6972 7.0123 8.2477 7.2194 5.2237 5.7282 6.4784 4.3959 7.1602 3.5438 4.1419 1.3672 1.3735 3.9407 6.6569 1.6442 6.6093 7.2327 1.6097 1.4859 1.4719 7.9066 6.4553 1.3673 1.3500 1.3561 6.3318 1.3314 3.5404 1.3320 2.1471 1.9870 3.7864 3.4908 1.2576 1.7163 1.9406 1.8609 1.6945 1.1684 1.1129 1.7967 2.6517 2.4767 2.4337 2.9994 1.8403 2.1044 3.0121 2.7275 2.5055 7.3640 9.5165 10.0738 1.2495 3.5306 2.5738 2.6096 3.8291 3.1122 1.0496 1.2444 3.5138 4.4290 7.5118 7.5467 7.0969 9.2101 8.9569 7.4792 7.3383 7.7474 1.0326 1.1042 1.0999 1.0862 1.0863 1.0905 1.0906 1.0873 1.0950 1.0950 1.0995 1.0993 1.0961 1.0928
irintensity: 1.8612 1.7011 1.6728 0.1502 3.8837 1.1658 2.3572 0.2723 0.1910 0.0258 2.5511 0.0481 1.0224 4.6411 0.2935 1.0675 4.2127 1.1361 0.3184 2.9961 0.0027 0.0648 3.6319 18.1954 19.5362 7.7688 1.9493 0.0299 0.4145 14.5373 4.9718 1.2135 5.4981 1.5701 1.4555 0.0636 0.8954 1.9611 10.5892 9.4084 1.1755 1.0976 118.1395 57.4798 1.7715 0.9720 31.4745 2.2322 3.3483 34.6924 1.9372 0.0038 3.8628 0.1900 1.3083 0.1073 6.7112 30.7656 0.1297 54.0399 0.1357 15.3593 1.1815 23.6598 11.2476 0.1848 22.9665 108.7501 65.4118 24.8614 9.7927 10.2172 53.8833 29.2157 60.2238 134.1446 28.4689 9.5840 102.6827 48.7050 7.2487 18.9281 6.8337 20.8084 34.4463 16.1826 4.1090 12.2783 8.8303 15.6900 99.6832 14.1938 200.8178 72.7232 74.6857 6.2590 96.3216 61.8437 610.2734 771.2407 32.4605 10.0762 89.3108 88.2440 43.8408 26.6677 3.9444 4.9505 14.4838 14.2911 1.7957 7.8222 7.9402 34.0086 28.3256 10.5906 1.7584
temp: 298.150 k
press: 1.00000 atm
elementType: 8 7 7 7 7 6 6 6 6 6 6 6 6 6 6 6 6 6 6 6 6 6 6 6 6 6 6 1 1 1 1 1 1 1 1 1 1 1 1 1 1
symmnumber: 1
zpe: 806191.9 jmol-1
zpe.correction: 0.307062 hartree
zpe.thermalcorrener: 0.326416 hartree
zpe.thermalcorrenthalpy: 0.327361 hartree
zpe.thermalcorrgfe: 0.259917 hartree
zpe.sumelectzpe: -1139.207002 hartree
zpe.sumelectthermal: -1139.187647 hartree
zpe.sumelectthermalent: -1139.186703 hartree
zpe.sumelectthermalfe: -1139.254147 hartree
dipole: -1.7375 -1.3331 0.0001
dipole: 2.1900
quadrupole: -118.8635 -135.9368 -161.4458
quadrupole: 10.0320 -0.0013 -0.0009
quadrupole: 19.8852 2.8119 -22.6971 10.0320 -0.0013 -0.0009
hfenergy: -1139.5140638 hartree
pointgroup: C01 [X(C22H14N4O1)]
dipole: 0.6842608 -0.5235923 -0.0000323 debye
polarizability: 481.2756084|3.3430032|415.1028868|-0.0099865|0.0066139|102.6362131 unknown
InChI: InChI=1S/C22H14N4O/c1-27-13-10-11-16-19(12-13)25-21-15-7-3-5-9-18(15)23-20-14-6-2-4-8-17(14)24-22(16)26(20)21/h2-12H,1H3
charge 0 multiplicity 1
41 atoms
O  5.869494 0.600479 -0.000048
N  -0.523528 -0.021001 0.000143
N  1.203909 1.696041 0.000128
N  0.097798 -2.375085 0.00007
N  -2.87186 0.617761 0.000209
C  0.441088 -1.092834 0.000095
C  -0.075157 1.348329 0.000161
C  -1.932689 -0.318816 0.000172
C  1.84555 -0.693916 0.000058
C  -1.12482 2.370458 0.000202
C  -2.293581 -1.7380 0.000143
C  2.188591 0.699175 0.000076
C  -1.256793 -2.725221 0.000094
C  -2.497873 1.966841 0.000225
C  2.878382 -1.663859 0.000004
C  -0.791137 3.750334 0.000219
C  -3.655724 -2.13853 0.000163
C  3.546927 1.088322 0.00004
C  -1.607645 -4.103729 0.000067
C  -3.516759 2.958975 0.000265
C  4.561062 0.108586 -0.000013
C  4.228277 -1.279929 -0.000031
C  -1.807885 4.719821 0.000259
C  -3.987366 -3.503558 0.000135
C  -2.958353 -4.487767 0.000088
C  -3.1746 4.321065 0.000282
C  6.969785 -0.369995 -0.000091
H  2.590927 -2.719174 -0.000009
H  0.267892 4.023664 0.0002
H  -4.421857 -1.357984 0.0002
H  3.80462 2.149872 0.000054
H  -0.797737 -4.839199 0.00003
H  -4.558416 2.624539 0.000282
H  5.007958 -2.046646 -0.000072
H  -1.54918 5.783843 0.000272
H  -5.038133 -3.811729 0.000151
H  -3.222509 -5.551023 0.000067
H  -3.963518 5.081144 0.000313
H  6.944056 -1.00606 -0.905536
H  6.944097 -1.006093 0.905333
H  7.885201 0.238998 -0.000101
