program: Gaussian 09
title: 000200130
version: EM64L-G09RevD.01
frameworkgroup: C1[X(C21H11FN4)]
method: RPBEPBE
basis: SDD
operation: Freq
keyword: #p
keyword: freq=noraman
keyword: PBEPBE/SDD
title: #p freq=noraman PBEPBE/SDD
converged: NO YES NO YES
title: Mulliken charges:
elementType: F N N N N C C C C C C C C C C C C C C C C C C C C C H H H H H H H H H H H
charge: -0.197025 -0.352684 -0.041754 -0.039586 -0.037233 0.073213 0.075214 0.076107 0.162443 0.149706 0.150422 0.137199 0.087934 0.084712 -0.314980 -0.334451 -0.336669 -0.537409 -0.361621 -0.361036 -0.395767 -0.245773 -0.245820 0.369640 -0.211069 -0.209953 0.283893 0.279831 0.279296 0.287554 0.261788 0.262312 0.261476 0.235153 0.234610 0.235040 0.235289
chargesum: 0.00000
title: Mulliken charges with hydrogens summed into heavy atoms:
elementType: F N N N N C C C C C C C C C C C C C C C C C C C C C
charge: -0.197025 -0.352684 -0.041754 -0.039586 -0.037233 0.073213 0.075214 0.076107 0.162443 0.149706 0.150422 0.137199 0.087934 0.084712 -0.031087 -0.054620 -0.057373 -0.249855 -0.099834 -0.098725 -0.134291 -0.010620 -0.011211 0.369640 0.023971 0.025336
polarizability: 4.17692491e+02 1.15159051e+00 4.07763538e+02 -7.98618009e-03 -3.31464652e-03 9.16355557e+01
1716.lowfreq: -7.7485 -0.0013 -0.0006 0.0010 4.9143 6.7798 50.9735 57.9343 64.8670
frequency: 50.9701 57.9333 64.8669 94.3901 133.0014 137.4649 160.3311 167.7545 240.5447 282.0083 283.9622 284.3904 291.4230 317.3412 339.7043 351.7925 363.7798 421.8633 438.4921 446.0681 484.3544 501.0551 529.8751 538.4914 544.6952 545.1871 572.6365 591.2586 609.7479 623.2559 629.6851 663.6162 664.0793 670.5963 676.5855 703.4216 741.8093 759.0062 770.4067 781.9817 782.7393 798.4284 808.1879 832.1438 839.9136 878.0748 889.5136 894.4533 895.4929 896.1219 951.3259 978.9959 979.8495 980.2457 994.4953 1002.7514 1003.4206 1021.8607 1030.7938 1076.8193 1084.5843 1108.6727 1119.6225 1126.7909 1145.8770 1167.6864 1169.2017 1210.1736 1213.9496 1227.3932 1241.2853 1254.9828 1269.4432 1294.3113 1311.4662 1321.0988 1376.6339 1396.3302 1399.0797 1431.1567 1446.7478 1450.8401 1462.5405 1468.7935 1472.9841 1492.2053 1560.2470 1561.8298 1565.7547 1581.3341 1583.8520 1618.5820 1620.1865 1623.3938 3137.1392 3137.2453 3153.3373 3153.8185 3167.5961 3168.5712 3169.4066 3176.7166 3177.3644 3185.5385 3189.6741
redmass: 6.7100 4.9306 5.8613 4.5325 7.4470 6.7299 5.2223 5.4593 7.2747 6.8522 5.9891 7.4861 10.0059 6.9634 7.1236 5.6060 6.5544 5.7619 3.3646 3.2809 3.5440 8.5323 3.6149 8.4215 3.6277 7.8729 9.4879 7.7833 4.7559 8.9850 7.0681 5.2733 7.2459 5.9031 6.6666 4.5566 8.0636 3.6234 4.0790 1.3672 1.3781 4.0688 6.6186 1.5816 6.6188 1.5750 7.3755 1.4826 1.4706 7.9012 4.2910 1.3646 1.3447 1.3611 6.1349 1.3347 1.3350 2.1456 1.9905 3.3770 3.4605 1.5573 1.9583 1.9355 2.2781 1.1551 1.1063 2.8097 2.6961 2.6137 2.8374 1.7147 2.1022 3.2697 2.8767 2.3799 7.6650 10.3627 10.2353 3.9160 2.5406 2.8207 4.5273 3.3994 3.5463 6.0175 7.4810 7.1790 8.6262 8.8111 9.0216 7.5279 7.4055 7.8548 1.0863 1.0864 1.0906 1.0906 1.0886 1.0951 1.0951 1.0995 1.0993 1.0972 1.0939
irintensity: 0.0020 0.0623 2.0253 2.2396 0.1093 0.6774 0.5257 0.0014 0.0690 0.8274 0.1187 4.7456 1.7121 3.4128 2.5692 0.0547 1.6117 3.7557 0.0006 0.0001 19.1064 7.0875 7.9415 2.9128 0.0139 0.6721 7.5282 5.2571 1.8728 4.8110 3.2225 0.0012 1.9675 1.0396 4.1873 9.2288 13.6269 1.7466 2.1490 125.5074 49.0168 0.7269 0.9905 29.5216 9.3786 45.1246 3.4735 1.0761 0.0749 3.0102 48.0779 0.5798 0.0254 6.8720 3.4194 0.1116 0.0421 13.2700 2.2208 13.0349 3.1895 10.4035 67.2950 50.8486 25.7006 0.0889 8.6793 46.0214 31.1142 41.4756 2.9897 12.3335 40.2640 12.4960 1.8375 2.1712 0.6509 30.4521 28.9981 17.8799 9.1133 1.5936 2.4225 107.2122 209.8938 13.9607 101.4549 38.4526 12.3819 664.3689 508.1480 43.7692 8.1100 9.2985 2.7757 4.8315 13.2665 13.1501 0.1615 6.9964 6.9927 29.9753 25.4547 3.2273 1.5375
temp: 298.150 k
press: 1.00000 atm
elementType: 9 7 7 7 7 6 6 6 6 6 6 6 6 6 6 6 6 6 6 6 6 6 6 6 6 6 1 1 1 1 1 1 1 1 1 1 1
symmnumber: 1
zpe: 701375.9 jmol-1
zpe.correction: 0.267140 hartree
zpe.thermalcorrener: 0.284708 hartree
zpe.thermalcorrenthalpy: 0.285652 hartree
zpe.thermalcorrgfe: 0.222030 hartree
zpe.sumelectzpe: -1124.024882 hartree
zpe.sumelectthermal: -1124.007314 hartree
zpe.sumelectthermalent: -1124.006370 hartree
zpe.sumelectthermalfe: -1124.069992 hartree
dipole: -2.5934 -0.2733 0.0001
dipole: 2.6078
quadrupole: -147.1950 -122.8794 -153.4600
quadrupole: -2.0774 -0.0002 -0.0003
quadrupole: -6.0169 18.2987 -12.2819 -2.0774 -0.0002 -0.0003
hfenergy: -1124.2920222 hartree
pointgroup: C01 [X(C21H11F1N4)]
dipole: -1.0204128 -0.1067451 0.0000276 debye
polarizability: 417.6942187|1.144119|407.7618107|-0.0079887|-0.0033086|91.6355557 unknown
InChI: InChI=1S/C21H11FN4/c22-12-9-10-15-18(11-12)25-20-14-6-2-4-8-17(14)23-19-13-5-1-3-7-16(13)24-21(15)26(19)20/h1-11H
charge 0 multiplicity 1
37 atoms
F  6.176859 -0.008324 -0.000083
N  -0.245058 0.001855 0.000049
N  1.611934 1.576087 -0.000024
N  0.190172 -2.392971 0.000048
N  -2.536093 0.821439 0.0001
C  0.630623 -1.143296 0.00003
C  0.307302 1.330469 0.000021
C  -1.673938 -0.185791 0.000083
C  2.066227 -0.857055 -0.000007
C  -0.656938 2.431866 0.000035
C  -2.144692 -1.572996 0.000111
C  2.510437 0.505047 -0.000029
C  -1.188604 -2.638323 0.000094
C  -2.058081 2.136557 0.000073
C  3.014241 -1.914155 -0.000019
C  -0.215207 3.781411 0.00001
C  -3.533805 -1.866456 0.000155
C  3.902758 0.789366 -0.000057
C  -1.643793 -3.984925 0.000122
C  -2.995876 3.205406 0.000081
C  4.390396 -1.637568 -0.000046
C  -1.153268 4.827046 0.00002
C  -3.969749 -3.202254 0.000182
C  4.797671 -0.282499 -0.000064
C  -3.020694 -4.263425 0.000167
C  -2.547393 4.536252 0.000054
H  2.640507 -2.94135 -0.000006
H  0.861882 3.970754 -0.000017
H  -4.237134 -1.028914 0.000164
H  4.245463 1.826507 -0.000075
H  -0.893082 -4.780702 0.000109
H  -4.060566 2.953977 0.000109
H  5.14081 -2.432693 -0.000058
H  -0.81231 5.867594 0.000003
H  -5.041316 -3.427624 0.000215
H  -3.366442 -5.302848 0.000191
H  -3.273947 5.356037 0.00006
