program: Gaussian 09
title: 000200089
version: EM64L-G09RevD.01
frameworkgroup: C1[X(C4H8N3O)]
method: RPBEPBE
basis: SDD
operation: Freq
keyword: #p
keyword: freq=noraman
keyword: PBEPBE/SDD
title: #p freq=noraman PBEPBE/SDD
converged: YES YES NO NO
title: Mulliken charges:
elementType: O N N N C C C C H H H H H H H H
charge: -0.155002 -0.024707 0.111121 -0.573762 -0.330277 -0.203040 -0.619853 0.356082 0.282890 0.275212 0.330010 0.232976 0.275144 0.254274 0.390752 0.398182
chargesum: 1.00000
title: Mulliken charges with hydrogens summed into heavy atoms:
elementType: O N N N C C C C
charge: -0.155002 -0.024707 0.111121 0.215171 0.227824 0.126970 0.142541 0.356082
polarizability: 9.58221277e+01 -7.32545369e+00 6.47602918e+01 3.79479680e+00 3.28741030e+00 3.90121662e+01
1716.lowfreq: -7.2408 -3.9471 -0.0008 -0.0008 0.0002 10.5746 45.4020 126.9919 205.4316
frequency: 45.3570 126.9898 205.4272 258.0288 303.1014 384.9069 392.2684 427.1020 559.8209 613.5208 637.5771 667.2391 716.3897 755.6922 794.6330 838.7444 918.3602 969.4430 1017.6670 1030.8040 1085.6966 1091.6294 1133.1018 1228.4108 1300.1088 1325.8322 1373.6070 1407.4176 1421.9845 1470.4386 1473.6079 1480.7364 1617.7478 1692.4949 3008.3234 3043.8940 3101.6237 3113.6053 3126.5933 3272.0019 3518.4687 3652.7880
redmass: 2.6482 3.3958 1.2881 2.8201 2.4348 1.2890 2.5507 3.2167 4.5502 3.1751 1.5340 2.3385 5.5313 1.8248 1.2009 6.0325 5.0983 2.5129 1.9630 3.4166 2.2387 2.3402 1.8131 1.5263 1.9193 1.4648 2.4344 1.2109 2.4112 1.0544 1.1124 1.1042 1.1914 5.9005 1.0365 1.0604 1.1034 1.1002 1.1052 1.1026 1.0478 1.1047
irintensity: 3.7856 2.1176 2.4724 2.2867 6.0960 1.3213 2.1388 6.1680 6.9936 51.2935 292.8238 0.7715 4.0945 71.8813 2.5313 11.1099 6.0796 6.6248 1.5582 3.0132 52.6616 7.0464 13.3005 1.7653 5.0975 4.2383 3.5263 12.2377 20.5126 16.4852 23.9816 18.5007 6.5062 556.5022 3.5557 3.9774 7.1892 3.6987 4.9765 26.5599 293.5768 112.7411
temp: 298.150 k
press: 1.00000 atm
elementType: 8 7 7 7 6 6 6 6 1 1 1 1 1 1 1 1
symmnumber: 1
zpe: 338562.2 jmol-1
zpe.correction: 0.128952 hartree
zpe.thermalcorrener: 0.136944 hartree
zpe.thermalcorrenthalpy: 0.137889 hartree
zpe.thermalcorrgfe: 0.096199 hartree
zpe.sumelectzpe: -395.766058 hartree
zpe.sumelectthermal: -395.758065 hartree
zpe.sumelectthermalent: -395.757121 hartree
zpe.sumelectthermalfe: -395.798811 hartree
dipole: 1.6803 -4.0934 -0.9521
dipole: 4.5261
quadrupole: -11.2995 -40.6898 -45.1913
quadrupole: -5.8937 2.1516 0.6966
quadrupole: 21.0940 -8.2962 -12.7978 -5.8937 2.1516 0.6966
hfenergy: -395.8950097 hartree
pointgroup: C01 [X(C4H8N3O1)]
dipole: -0.6877915 -1.6409244 -0.0722275 debye
dipolederiv: -0.5409026 0.1753258 -0.017253 -0.3361887 -0.1539077 -0.0566339 -0.1090122 0.0239423 -0.0720876 -0.0276449 0.2285835 0.0392788 0.5329187 0.3550689 0.0616311 0.0825816 0.0368062 -0.0098467 0.2936854 -0.1624202 0.0263946 -0.3662138 -0.1083886 -0.0308443 0.0238543 -0.0322993 -0.0197909 -1.4268521 -0.3617771 -0.1276272 -0.3480085 -0.2765713 -0.0236358 -0.1520985 -0.031585 -0.630372 0.5774846 -0.0392682 -0.014882 0.0298062 0.1296541 -0.0214003 0.0582582 -0.0220338 0.2034274 -0.7242197 -0.3832113 -0.0938665 0.1915849 -0.1137796 0.0278113 -0.0806848 -0.0546481 -0.1642551 -0.1085284 0.0217957 -0.0031206 -0.0160256 0.0697187 -0.0106999 -0.1005122 -0.003073 -0.0045379 1.8665101 0.4759772 0.2417788 0.2830721 0.2526853 0.0310546 0.2608027 0.0730831 0.3427901 0.0793298 0.0535286 0.0194598 0.0089703 0.0070658 -0.0602213 0.0095995 -0.0249539 0.1098147 0.0164423 -0.0247077 0.0532821 -0.0235982 0.0696903 0.0944325 0.030514 0.0502149 0.0197091 0.1371311 0.0127511 -0.0210395 0.0010124 0.1641509 -0.0107919 -0.0248503 -0.0113879 0.2449312 0.0804759 -0.1075749 -0.0077114 -0.0751907 -0.0579827 -0.055213 0.0202203 -0.0242375 0.0629039 -0.0411778 0.0097485 -0.0382381 0.0214652 0.1349513 -0.012516 -0.0060376 -0.0141211 0.0920863 0.1211769 0.0500901 -0.0327475 0.0402043 0.0119417 0.0836491 0.004976 0.0503853 -0.0068667 0.2778062 0.0623924 -0.0192136 0.1874078 0.3148138 0.0168304 -0.0093921 0.0014651 0.4182621 0.4192832 -0.0112337 -0.0044946 -0.1312163 0.2008893 -0.0334525 -0.0082189 -0.0175573 0.4138319 unknown
polarizability: 96.0679984|5.5411968|64.3991796|5.3855581|3.7932458|39.1274077 unknown
InChI: InChI=1S/C4H8N3O/c1-2-7-3-4(5)8-6-7/h3H,2,5H2,1H3
charge 1 multiplicity 1
16 atoms
O  -1.291044 1.109918 0.11203
N  0.635203 0.085402 0.348196
N  0.124278 1.33975 0.356984
N  -2.77977 -0.682217 -0.248146
C  2.117552 -0.053789 0.552182
C  -0.279897 -0.918833 0.127335
C  2.824294 -0.551875 -0.71984
C  -1.521543 -0.267481 -0.022319
H  2.471371 0.946623 0.849886
H  2.256696 -0.744768 1.40116
H  -0.017978 -1.97082 0.097039
H  2.489247 -1.558849 -1.021772
H  3.905595 -0.610025 -0.509343
H  2.680051 0.14465 -1.562058
H  -2.998322 -1.673046 -0.354151
H  -3.544333 -0.006939 -0.316383
