program: Gaussian 09
title: 000200079
version: EM64L-G09RevD.01
frameworkgroup: C1[X(C14H18N2O)]
method: RPBEPBE
basis: SDD
operation: Freq
keyword: #p
keyword: freq=noraman
keyword: PBEPBE/SDD
title: #p freq=noraman PBEPBE/SDD
converged: YES YES NO NO
title: Mulliken charges:
elementType: O N N C C C C C C C C C C C C C C H H H H H H H H H H H H H H H H H H
charge: -0.285382 -0.167091 -0.385273 -0.116880 -0.398766 -0.239463 -0.421151 -0.419362 -0.380727 0.166028 0.478790 -0.586324 -0.395281 0.442874 -0.220202 -0.397795 -0.813621 0.238024 0.219519 0.218487 0.247418 0.191557 0.223444 0.266107 0.210683 0.220592 0.203276 0.235232 0.268739 0.251666 0.225547 0.232222 0.234583 0.226391 0.226142
chargesum: 0.00000
title: Mulliken charges with hydrogens summed into heavy atoms:
elementType: O N N C C C C C C C C C C C C C C
charge: -0.285382 -0.167091 -0.133607 0.121144 0.039240 0.007955 -0.006150 0.057427 0.043140 0.166028 0.478790 -0.351093 -0.126542 0.442874 0.005345 -0.165573 -0.126505
polarizability: 2.09200886e+02 1.79536983e+01 1.41864807e+02 1.21428463e+00 -1.61286033e+01 1.35170512e+02
1716.lowfreq: -9.6803 -0.0003 0.0004 0.0009 5.2334 8.3728 27.5531 30.1824 48.8571
frequency: 27.4563 30.0831 48.8447 69.8686 90.1849 135.9966 196.8663 200.7157 219.8462 241.9531 263.0730 290.9134 328.7712 370.5809 417.7497 424.6772 436.2945 478.7479 515.7755 528.0473 579.9885 614.0692 639.6873 653.6289 700.2819 709.2341 717.3322 748.3629 751.3722 806.8851 818.3367 824.9393 847.8338 877.9796 898.6997 916.9592 924.2546 935.1499 949.8226 961.5291 989.1178 992.3319 1004.0017 1026.4173 1027.8355 1048.4158 1077.7320 1094.0794 1102.5946 1121.1037 1130.1017 1166.2741 1176.5061 1182.4258 1209.9512 1224.0561 1252.9628 1256.2568 1264.8503 1287.5353 1302.1435 1312.6452 1325.8773 1332.7459 1338.1328 1352.8044 1356.1378 1375.0462 1382.0793 1397.7421 1430.4000 1453.6571 1461.1557 1463.1979 1471.7579 1472.2018 1473.8861 1487.4149 1600.9335 1620.1835 1700.7692 2963.0022 2974.6485 2976.3034 2981.8576 2988.8834 2990.0888 2996.4152 3037.1377 3051.3094 3056.0569 3058.4602 3083.9731 3085.0018 3102.4693 3120.4813 3142.9537 3166.8242 3452.6874
redmass: 3.4645 1.0444 3.9482 4.0743 4.5949 3.0669 4.7230 3.6300 3.5597 3.3213 2.7992 3.2691 2.1282 2.8978 3.3388 3.8396 2.9969 3.1244 5.0244 2.1662 3.1500 4.3545 6.5253 8.4686 3.2755 1.2009 2.7343 3.1472 3.4615 1.5500 2.6540 1.7629 2.7220 2.6398 1.3438 2.4392 1.5121 1.8657 2.3344 2.2460 3.8563 1.5453 1.6443 2.0344 1.9802 1.5633 1.6684 1.7916 1.8449 1.9543 2.1890 1.5118 1.4833 1.1436 1.8120 1.6107 1.4072 2.0738 1.6823 1.4352 1.5833 1.2972 1.4656 1.3407 1.4662 1.3554 1.3790 2.4619 5.9725 1.2256 2.4428 1.0966 1.0844 1.0895 1.1866 1.2146 1.0842 1.8969 6.0685 6.0866 7.2996 1.0651 1.0388 1.0831 1.0686 1.0617 1.0615 1.0849 1.0953 1.1021 1.0950 1.1030 1.0978 1.0997 1.0911 1.0873 1.0931 1.0968 1.0769
irintensity: 0.1229 0.5813 0.2093 0.6817 0.5652 1.3439 0.8343 2.0052 0.4456 3.9646 2.5658 1.9432 5.0915 4.5948 2.8328 6.3818 7.4772 5.3998 1.0171 6.0417 5.3007 10.8346 14.7071 5.4091 7.1615 89.1556 26.3279 25.1455 3.6793 26.9375 15.9811 21.0072 18.7038 63.6213 4.7390 42.2908 12.2025 4.3334 58.5922 14.7363 0.3749 3.0176 16.8637 5.5496 110.9725 15.1243 4.1988 28.8027 9.2520 48.4382 23.2489 21.0709 2.7249 1.0359 92.5781 11.3786 0.7673 3.5368 46.1601 37.0273 23.6107 3.9776 5.6298 0.9113 5.2001 5.5248 1.4177 77.0263 3.9515 12.8549 5.6111 5.8500 26.7004 13.3748 4.2067 17.9634 13.5457 16.9207 6.3556 19.3260 443.2662 36.8052 35.6494 9.7285 48.5375 13.3340 41.1807 48.9362 46.6954 43.1807 22.2808 56.4563 5.2284 16.0122 19.5384 9.3795 23.9895 8.3316 22.2199
temp: 298.150 k
press: 1.00000 atm
elementType: 8 7 7 6 6 6 6 6 6 6 6 6 6 6 6 6 6 1 1 1 1 1 1 1 1 1 1 1 1 1 1 1 1 1 1
symmnumber: 1
zpe: 772589.1 jmol-1
zpe.correction: 0.294264 hartree
zpe.thermalcorrener: 0.309562 hartree
zpe.thermalcorrenthalpy: 0.310506 hartree
zpe.thermalcorrgfe: 0.250294 hartree
zpe.sumelectzpe: -727.751131 hartree
zpe.sumelectthermal: -727.735832 hartree
zpe.sumelectthermalent: -727.734888 hartree
zpe.sumelectthermalfe: -727.795101 hartree
dipole: 2.5484 3.6603 -0.2642
dipole: 4.4679
quadrupole: -101.9397 -103.2994 -96.3650
quadrupole: -6.0963 -0.6358 -4.1614
quadrupole: -1.4050 -2.7647 4.1697 -6.0963 -0.6358 -4.1614
hfenergy: -728.0453945 hartree
pointgroup: C01[X(C14H18N2O1)]
dipole: 0.9665455 1.4680487 0.0220448 debye
polarizability: 208.3814732|18.9764194|146.0301251|1.6474308|-15.4690802|131.8246065 unknown
InChI: InChI=1S/C14H18N2O/c1-10-5-4-6-11(9-10)13-12-7-2-3-8-16(12)14(15)17-13/h4-6,9,12-13,15H,2-3,7-8H2,1H3
charge 0 multiplicity 1
35 atoms
O  -0.801871 -1.698453 -0.467958
N  -2.377718 -0.049445 -0.693134
N  -3.146236 -2.250998 -0.124202
C  -1.092905 0.685714 -0.631674
C  -0.938685 1.406062 0.728825
C  -0.08666 -0.474004 -0.946372
C  -2.195362 2.27059 1.006693
C  -3.624818 0.660262 -0.364129
C  -3.485164 1.411402 0.984096
C  -2.205349 -1.403223 -0.406041
C  1.283223 -0.372071 -0.308309
C  2.292392 0.378285 -0.960103
C  1.569033 -0.992425 0.930903
C  3.578604 0.543398 -0.3882
C  2.8503 -0.847621 1.505984
C  3.8454 -0.083436 0.856389
C  4.640397 1.377575 -1.084933
H  -1.054891 1.439429 -1.443233
H  -0.025284 2.029764 0.720423
H  -0.814954 0.657549 1.535329
H  0.007287 -0.565115 -2.04636
H  -2.272068 3.069847 0.239014
H  -2.093338 2.778355 1.984029
H  -4.428068 -0.094086 -0.326727
H  -3.850972 1.379324 -1.176532
H  -3.45272 0.670556 1.806424
H  -4.376926 2.046574 1.145915
H  2.079098 0.837641 -1.935403
H  0.800464 -1.604438 1.412423
H  -2.814733 -3.220567 0.000756
H  3.077113 -1.339116 2.458891
H  4.839055 0.018793 1.30973
H  4.57628 2.440573 -0.780438
H  5.657238 1.027055 -0.835382
H  4.528141 1.344051 -2.183093
