program: Gaussian 09
title: 000200071
version: EM64L-G09RevD.01
frameworkgroup: C1[X(C14H18N2O2)]
method: RPBEPBE
basis: SDD
operation: Freq
keyword: #p
keyword: freq=noraman
keyword: PBEPBE/SDD
title: #p freq=noraman PBEPBE/SDD
converged: YES YES NO NO
title: Mulliken charges:
elementType: O O N N C C C C C C C C C C C C C C H H H H H H H H H H H H H H H H H H
charge: -0.259224 -0.263139 -0.163820 -0.397570 -0.126636 -0.415390 -0.307108 -0.416678 -0.417862 -0.381031 0.180951 0.580025 -0.444285 -0.367726 -0.351420 -0.366709 0.316794 -0.537816 0.254028 0.212320 0.205414 0.225339 0.224041 0.194115 0.208709 0.265967 0.203621 0.219848 0.231444 0.257066 0.253313 0.251316 0.241201 0.220781 0.246156 0.223964
chargesum: 0.00000
title: Mulliken charges with hydrogens summed into heavy atoms:
elementType: O O N N C C C C C C C C C C C C C C
charge: -0.259224 -0.263139 -0.163820 -0.144256 0.127392 0.002345 -0.081769 0.001478 0.056814 0.042439 0.180951 0.580025 -0.212841 -0.110661 -0.100104 -0.125508 0.316794 0.153085
polarizability: 2.25466824e+02 -7.92529413e+00 1.51655774e+02 -5.17315317e+00 -9.80046352e+00 1.35848210e+02
1716.lowfreq: -19.9772 -8.6250 -2.4558 0.0006 0.0010 0.0010 15.3942 37.8631 46.9541
frequency: 14.5193 37.5421 46.8665 76.7751 96.0870 136.2634 152.7953 190.7525 227.1351 231.7242 251.2212 253.3873 285.8245 330.5725 363.5531 410.3268 412.2105 434.5050 463.6615 472.3571 526.7179 544.3469 568.7515 615.7621 629.0790 647.6644 710.6017 716.1753 728.3804 738.3601 751.3756 812.4596 818.3956 821.3031 836.7532 842.4603 867.6224 894.4396 920.5233 933.0897 948.6785 959.8102 964.0532 987.3047 1003.9089 1021.0099 1045.0882 1072.8391 1080.3746 1112.4278 1112.8244 1127.6406 1133.1654 1156.2758 1160.8832 1180.6038 1205.9088 1220.7378 1230.4537 1234.4471 1252.1234 1255.9231 1282.2099 1295.6455 1310.1868 1327.6824 1333.1754 1338.8016 1349.4164 1356.8941 1378.9647 1395.3713 1424.2725 1437.0144 1456.6031 1458.8989 1464.4855 1466.6122 1471.3561 1472.7604 1503.9649 1584.8699 1623.3060 1692.7174 2960.8561 2964.7052 2975.5418 2977.4145 2988.8218 2990.4377 3036.4053 3042.0136 3043.0724 3048.9629 3054.1943 3081.4400 3123.2100 3125.9680 3128.8503 3162.9632 3168.0989 3451.3112
redmass: 3.7578 3.9780 4.2814 4.3196 3.7206 3.6916 4.1499 2.6269 1.8227 3.3846 2.2553 2.9169 3.4449 2.0088 5.1355 3.5781 3.0386 3.7534 3.3678 3.5150 2.2677 4.3541 2.3233 4.3302 6.6906 8.7774 1.1873 4.1068 4.1869 4.4459 4.3861 2.2191 1.6326 1.7108 2.0393 2.2667 2.5691 2.6271 3.3788 2.0007 1.4938 1.7832 1.3740 8.6023 2.6945 1.8575 2.3083 1.8318 1.8017 1.3362 1.2900 1.8311 2.2280 1.3407 1.3520 1.2501 1.8735 1.6391 2.1756 2.7767 1.5153 1.3092 1.7073 1.5199 1.3058 1.5493 1.3474 1.4427 1.4836 1.3701 2.4005 3.5077 2.8047 1.1824 1.0915 1.0866 1.0858 1.0499 1.0911 1.0741 2.5146 7.0138 6.3212 7.2348 1.0329 1.0649 1.0621 1.0671 1.0612 1.0841 1.0960 1.0886 1.1012 1.1040 1.1023 1.0976 1.0897 1.0986 1.0906 1.0936 1.0951 1.0768
irintensity: 0.7967 1.9394 0.3226 0.4124 3.7411 3.4621 1.4060 1.4358 0.2427 2.0111 2.8847 3.3520 0.7408 2.7288 6.9104 9.6745 2.9940 2.8158 9.8317 0.3406 20.7952 15.7212 17.4140 19.5057 4.1388 5.2774 87.6805 5.0100 1.6909 12.0108 0.9265 51.2592 20.9007 11.0015 55.4248 5.9209 65.0730 74.8909 75.0818 5.6469 7.6214 15.0538 1.5394 39.7650 4.5042 44.0265 12.6094 67.0440 9.2728 18.3136 6.2869 19.2361 34.5321 0.3229 34.5858 84.6244 27.3082 7.0186 46.9977 255.2968 6.9779 8.3923 53.8204 16.0087 5.9894 21.6859 1.6458 8.7603 2.5275 13.1050 56.7392 4.6415 1.0722 9.7511 4.9286 24.2908 13.5773 13.6277 7.0180 53.9419 97.5782 11.4407 78.8457 423.7173 63.4394 34.3438 36.9142 26.4413 37.4707 21.9788 49.0413 31.3010 43.4583 47.1187 69.0703 5.1715 12.8690 30.5282 1.0975 12.1598 6.6139 22.7368
temp: 298.150 k
press: 1.00000 atm
elementType: 8 8 7 7 6 6 6 6 6 6 6 6 6 6 6 6 6 6 1 1 1 1 1 1 1 1 1 1 1 1 1 1 1 1 1 1
symmnumber: 1
zpe: 783723.3 jmol-1
zpe.correction: 0.298504 hartree
zpe.thermalcorrener: 0.314700 hartree
zpe.thermalcorrenthalpy: 0.315644 hartree
zpe.thermalcorrgfe: 0.253189 hartree
zpe.sumelectzpe: -802.875124 hartree
zpe.sumelectthermal: -802.858929 hartree
zpe.sumelectthermalent: -802.857984 hartree
zpe.sumelectthermalfe: -802.920439 hartree
dipole: 1.0136 -2.2772 -2.9137
dipole: 3.8344
quadrupole: -98.8054 -108.5866 -103.3828
quadrupole: 15.1137 -2.6741 -6.5625
quadrupole: 4.7862 -4.9950 0.2088 15.1137 -2.6741 -6.5625
hfenergy: -803.1736285 hartree
pointgroup: C01 [X(C14H18N2O2)]
dipole: -0.4545608 -1.1582606 0.8530026 debye
polarizability: 226.1514611|3.8292324|144.0572902|-4.2929325|12.5810353|142.7620571 unknown
InChI: InChI=1S/C14H18N2O2/c1-17-11-7-5-10(6-8-11)13-12-4-2-3-9-16(12)14(15)18-13/h5-8,12-13,15H,2-4,9H2,1H3
charge 0 multiplicity 1
36 atoms
O  1.033104 0.922413 -1.525998
O  -5.056225 0.049819 0.400565
N  2.099442 0.32251 0.410712
N  2.637929 2.456705 -0.539277
C  1.47014 -0.936012 -0.043272
C  2.539325 -1.928333 -0.564743
C  0.470185 -0.42917 -1.130229
C  3.664868 -2.102884 0.486266
C  3.228951 0.260816 1.350702
C  4.303378 -0.738076 0.850609
C  1.986164 1.333392 -0.544044
C  -0.970994 -0.29376 -0.689197
C  -2.016838 -0.822478 -1.488452
C  -1.311836 0.374033 0.512972
C  -3.363306 -0.696669 -1.101231
C  -2.656113 0.51452 0.915539
C  -3.687358 -0.025713 0.104064
C  -5.447471 0.752046 1.625644
H  0.920141 -1.402367 0.797111
H  2.968528 -1.535357 -1.5085
H  2.062193 -2.901255 -0.793362
H  0.533599 -1.047368 -2.042799
H  4.437382 -2.795152 0.102442
H  3.244336 -2.570127 1.401828
H  2.853199 -0.057545 2.343883
H  3.635069 1.282397 1.436896
H  5.076457 -0.869517 1.631691
H  4.802803 -0.311544 -0.040923
H  -1.774869 -1.334149 -2.428194
H  -0.516581 0.800865 1.135857
H  2.376275 3.095451 -1.307051
H  -4.176442 -1.101211 -1.711207
H  -2.887195 1.042375 1.845465
H  -5.028309 0.258895 2.524282
H  -6.545492 0.695272 1.650292
H  -5.128937 1.81228 1.601155
