program: Gaussian 09
title: 000200075
version: EM64L-G09RevD.01
frameworkgroup: C1[X(C14H18N2O2)]
method: RPBEPBE
basis: SDD
operation: Freq
keyword: #p
keyword: freq=noraman
keyword: PBEPBE/SDD
title: #p freq=noraman PBEPBE/SDD
converged: NO YES NO NO
title: Mulliken charges:
elementType: O O N N C C C C C C C C C C C C C C H H H H H H H H H H H H H H H H H H
charge: -0.260169 -0.269291 -0.164856 -0.395601 -0.127968 -0.414652 -0.293418 -0.417253 -0.416139 -0.380090 0.180429 0.606096 -0.610531 -0.395888 0.334991 -0.207482 -0.370313 -0.537054 0.257621 0.211438 0.204420 0.219944 0.224133 0.195447 0.210414 0.266544 0.204585 0.218662 0.240645 0.259859 0.254062 0.228266 0.253463 0.247164 0.218674 0.223848
chargesum: 0.00000
title: Mulliken charges with hydrogens summed into heavy atoms:
elementType: O O N N C C C C C C C C C C C C C C
charge: -0.260169 -0.269291 -0.164856 -0.141539 0.129653 0.001206 -0.073474 0.002326 0.060820 0.043157 0.180429 0.606096 -0.369887 -0.136029 0.334991 0.020784 -0.116850 0.152632
polarizability: 2.19964782e+02 -1.56172721e+01 1.54944220e+02 1.54673578e+00 8.86390428e+00 1.34415196e+02
1716.lowfreq: -22.6912 -11.4973 0.0009 0.0009 0.0010 3.3541 8.4766 36.5643 61.5997
frequency: -11.2983 36.2763 61.5607 81.0121 98.1258 142.0724 144.0918 192.7518 208.1071 243.3511 250.3910 259.5223 284.8824 311.0426 332.8362 412.0938 431.7197 439.2646 443.5519 471.5273 532.8381 540.3702 614.1036 616.9407 630.1735 647.3263 699.8156 704.3377 711.4661 732.8102 754.6624 802.6906 817.7633 835.4355 854.0302 864.4692 879.9006 907.7185 911.7614 930.9662 939.3174 958.3473 981.0193 982.1602 1004.4568 1022.1262 1048.2848 1073.9213 1079.8694 1085.2222 1112.2271 1126.5053 1133.0279 1155.0668 1160.9094 1169.2309 1177.5782 1222.4049 1226.5224 1247.0696 1256.2936 1260.7631 1283.5476 1295.9952 1311.6125 1331.9676 1332.9696 1338.9610 1351.2194 1358.7566 1381.1741 1393.6227 1429.0153 1452.9125 1456.1833 1460.1661 1464.2783 1466.1323 1469.3829 1474.0082 1486.5501 1602.8245 1609.4504 1696.4442 2957.5952 2967.0116 2974.3603 2977.4642 2989.4985 2990.5106 3035.4193 3037.2123 3042.8937 3044.8612 3055.1153 3081.1097 3124.8671 3133.2281 3140.4071 3151.8187 3172.0233 3453.7876
redmass: 4.7028 3.8579 4.0336 4.9099 3.2690 3.9860 3.4953 1.8611 3.4588 4.0762 2.1264 2.0203 3.5416 3.9625 2.0846 3.7816 3.7649 3.6894 3.5647 2.9900 4.9615 2.0428 4.8738 4.2935 4.8838 7.9408 1.9431 1.2596 4.3286 4.5000 4.4503 1.5147 1.8265 2.1057 2.3371 2.4573 2.0552 1.5199 2.4779 2.1001 4.5463 1.9604 1.8867 2.5272 4.7117 1.8717 2.2280 1.7739 1.9374 1.5600 1.2603 2.0057 2.0758 1.3529 1.3588 1.5156 1.2569 1.6243 1.9786 1.8149 1.2995 2.2250 1.7271 1.5350 1.2973 1.3861 1.3302 1.4510 1.4054 1.3802 2.2962 6.4352 1.3956 1.8873 1.0998 1.0855 1.0872 1.0502 1.1780 1.0903 2.0577 6.5464 6.0505 7.2428 1.0332 1.0647 1.0619 1.0675 1.0618 1.0834 1.0876 1.0961 1.1022 1.1039 1.1023 1.0977 1.0990 1.0870 1.0905 1.0937 1.0976 1.0769
irintensity: 0.3057 0.2064 0.4983 1.0007 6.9285 1.3557 0.2052 0.3807 2.7336 0.5134 5.5301 1.9827 4.2012 3.3774 4.8532 10.2151 0.9345 5.8101 5.1731 1.8144 4.9070 7.5717 1.9157 24.2510 3.4264 4.6904 28.0254 80.8459 3.8315 7.9916 38.5542 60.3638 0.9274 28.8375 86.9097 10.7416 25.7471 10.7525 46.4328 3.5209 69.0819 21.8886 1.7134 5.9745 38.4759 47.2621 6.9335 58.1266 24.9546 16.2161 0.1980 27.1662 26.1064 0.9902 32.0240 66.3344 14.8998 17.8278 59.1967 112.3027 5.1508 83.2115 67.0978 6.0332 9.7835 8.3377 1.7823 7.8071 1.4463 15.9721 57.1802 12.3739 20.9634 13.6292 7.4427 25.3386 13.1891 13.6724 84.6826 7.4988 17.4732 10.7336 110.5278 433.6021 56.7620 33.7033 30.8417 32.6636 37.8617 18.2052 17.3659 57.1944 49.8247 49.4979 68.0598 5.2035 28.0145 5.3830 11.6583 6.2363 10.4874 23.8527
temp: 298.150 k
press: 1.00000 atm
elementType: 8 8 7 7 6 6 6 6 6 6 6 6 6 6 6 6 6 6 1 1 1 1 1 1 1 1 1 1 1 1 1 1 1 1 1 1
symmnumber: 1
zpe: 783748.1 jmol-1
zpe.correction: 0.298514 hartree
zpe.thermalcorrener: 0.313794 hartree
zpe.thermalcorrenthalpy: 0.314738 hartree
zpe.thermalcorrgfe: 0.255961 hartree
zpe.sumelectzpe: -802.874543 hartree
zpe.sumelectthermal: -802.859263 hartree
zpe.sumelectthermalent: -802.858319 hartree
zpe.sumelectthermalfe: -802.917095 hartree
dipole: -0.7918 4.3339 -1.0958
dipole: 4.5399
quadrupole: -106.0598 -104.2436 -105.3755
quadrupole: 2.3244 -10.1514 7.4319
quadrupole: -0.8335 0.9827 -0.1492 2.3244 -10.1514 7.4319
hfenergy: -803.1730567 hartree
pointgroup: C01 [X(C14H18N2O2)]
dipole: -0.3862656 -1.7308273 0.2127368 debye
polarizability: 220.8699875|12.6422035|151.4992676|4.0498878|11.5041864|136.9549426 unknown
InChI: InChI=1S/C14H18N2O2/c1-17-11-6-4-5-10(9-11)13-12-7-2-3-8-16(12)14(15)18-13/h4-6,9,12-13,15H,2-3,7-8H2,1H3
charge 0 multiplicity 1
36 atoms
O  0.848216 0.683391 -1.499432
O  -4.807927 -0.462533 -0.28434
N  2.235775 0.275831 0.276818
N  2.860202 2.021435 -1.243218
C  1.320986 -0.884535 0.282575
C  2.062604 -2.174441 -0.146087
C  0.201127 -0.426966 -0.706272
C  3.355297 -2.353565 0.691008
C  3.525075 0.17809 0.977903
C  4.275339 -1.112916 0.564867
C  2.060326 1.077906 -0.849456
C  -1.082695 0.063039 -0.06263
C  -2.321683 -0.463039 -0.504997
C  -1.05444 1.039301 0.962542
C  -3.529638 -0.010413 0.080251
C  -2.266086 1.485142 1.537057
C  -3.502961 0.966724 1.105356
C  -4.89732 -1.451977 -1.360141
H  0.902819 -1.025112 1.298217
H  2.322639 -2.103055 -1.221582
H  1.391407 -3.04643 -0.02087
H  -0.02049 -1.221865 -1.440484
H  3.894035 -3.263213 0.366162
H  3.085304 -2.505989 1.757313
H  3.340839 0.172785 2.071089
H  4.101897 1.08228 0.721436
H  5.1748 -1.233599 1.198203
H  4.619331 -1.009886 -0.482641
H  -2.329569 -1.21009 -1.306404
H  -0.095634 1.453255 1.293506
H  2.528578 2.533478 -2.075905
H  -2.249726 2.2450 2.325959
H  -4.450814 1.301271 1.537611
H  -5.97291 -1.644395 -1.485185
H  -4.380612 -2.393133 -1.087174
H  -4.476592 -1.058479 -2.306057
