program: Gaussian 09
title: 000198447
version: EM64L-G09RevD.01
frameworkgroup: C1[X(C16H24N8O5)]
method: RPBEPBE
basis: SDD
operation: Freq
keyword: #p
keyword: freq=noraman
keyword: PBEPBE/SDD
title: #p freq=noraman PBEPBE/SDD
converged: YES YES NO NO
title: Mulliken charges:
elementType: O O O O O N N N N N N N N C C C C C C C C C C C C C C C C H H H H H H H H H H H H H H H H H H H H H H H H
charge: -0.287070 -0.275981 -0.418385 -0.407679 -0.285604 -0.379495 -0.203570 -0.608281 -0.057466 -0.336045 -0.628071 -0.642599 -0.653516 -0.138886 -0.122719 -0.135261 -0.228294 -0.051544 -0.167991 -0.572837 0.240733 -0.439699 0.206436 -0.414781 -0.075399 0.051695 -0.383096 0.192093 0.425681 0.295849 0.225309 0.280582 0.245451 0.294490 0.257356 0.280213 0.205720 0.247315 0.216786 0.279038 0.210739 0.206477 0.265973 0.261688 0.351765 0.225486 0.396249 0.311277 0.333694 0.331802 0.342098 0.305778 0.426499
chargesum: 0.00000
title: Mulliken charges with hydrogens summed into heavy atoms:
elementType: O O O O O N N N N N N N N C C C C C C C C C C C C C C C C
charge: -0.287070 -0.275981 -0.418385 -0.407679 -0.285604 -0.085006 -0.203570 -0.080620 -0.057466 0.060204 0.016899 0.031300 0.078761 0.156963 0.102589 0.145321 0.017157 0.205811 0.112221 -0.119801 0.240733 0.056126 0.206436 0.002436 0.276366 0.051695 -0.157610 0.192093 0.425681
polarizability: 3.24436996e+02 1.07908544e+01 2.65749731e+02 4.85598706e-01 2.87192510e+01 1.70041931e+02
1716.lowfreq: -1.7388 -0.0004 -0.0003 0.0004 3.6187 6.9906 17.5130 28.9147 40.6020
frequency: 17.1155 28.8960 40.5710 46.6064 56.2478 71.2586 74.4631 92.7159 102.1177 115.5777 130.3981 132.2472 140.7655 158.7181 164.7658 174.6371 183.6269 202.1932 214.0676 218.1624 222.1606 239.6327 270.3444 302.8740 309.8050 314.1576 328.5439 344.5775 367.1663 377.5261 401.8134 403.8667 407.8289 428.6115 439.9143 450.2914 452.5345 472.6184 493.8650 506.4701 515.6421 525.5605 531.8222 548.0489 552.2712 554.9145 569.6900 574.5437 602.0357 619.1029 649.1636 667.8389 672.8482 695.3952 698.7652 704.5154 726.5289 738.6449 746.1977 779.5756 784.9599 794.6075 834.7324 842.9997 861.9055 921.9185 929.0255 934.2243 941.4462 950.8197 973.9028 985.1373 995.2451 1006.4796 1014.5872 1021.4911 1025.4667 1032.7374 1041.3139 1054.2052 1063.2803 1072.1381 1091.7708 1101.9112 1124.2125 1130.8595 1155.7935 1158.7756 1167.0501 1183.4213 1187.1034 1199.1638 1199.3294 1217.4400 1242.6780 1246.4965 1257.0083 1266.5085 1274.2616 1283.7286 1301.8609 1313.8155 1321.9243 1339.6672 1344.4748 1347.6864 1348.4612 1363.0185 1369.0354 1371.4298 1404.0693 1456.7054 1462.9516 1464.1017 1469.9152 1471.5267 1478.6490 1507.1781 1512.7141 1579.9886 1596.8594 1606.5351 1621.6103 1629.5880 1634.1198 1640.2390 1669.7111 1699.7590 1715.6506 2457.5299 2617.8552 2933.9489 2959.2902 2988.0450 2989.6635 2994.3586 3003.9921 3031.1874 3043.7720 3062.6231 3082.0486 3084.6052 3131.1953 3178.6141 3183.3537 3436.7163 3539.4021 3545.1937 3563.2696 3565.5981 3597.2274 3704.7419 3705.9373
redmass: 5.7756 6.1206 5.3231 7.0329 6.1671 5.1238 5.1905 4.7137 6.0713 6.4982 5.1969 4.2831 3.9508 4.5941 1.8262 5.8395 3.2219 5.5954 5.6099 5.3355 3.1762 7.7307 2.7930 4.2628 5.6248 3.2938 5.3842 3.6373 4.2938 2.2369 2.6660 1.2561 1.4332 3.6153 2.8605 1.3597 2.9247 3.4444 2.3694 4.1278 2.2679 2.4879 2.0677 4.3204 1.2781 2.4269 2.5869 2.2389 2.3082 2.2634 3.1999 5.9140 6.3642 3.1855 4.8792 2.3943 6.2957 7.2073 5.3737 1.8088 4.0462 2.5351 3.7727 2.4363 4.4756 4.4028 3.5016 2.6155 2.3434 2.9204 1.9161 1.8999 2.3738 3.2387 3.0131 2.5332 1.5606 2.3759 2.1672 2.8082 1.6147 1.8901 2.1197 2.3827 1.3595 3.0176 1.2170 1.7237 1.3324 1.1782 1.5940 5.1553 1.6425 1.4029 1.5288 1.2163 1.4158 1.2699 1.3316 1.3125 1.3173 1.5337 1.3143 3.2513 1.2322 1.5145 1.3194 1.9105 1.3080 2.0429 1.4908 1.1409 3.9587 1.1116 3.9443 1.1205 1.7929 3.9408 3.7162 2.7440 1.6709 5.8351 1.8331 6.4542 1.4182 1.1134 7.4651 1.8718 1.2673 1.1370 1.1019 1.0839 1.0640 1.0640 1.0824 1.0644 1.0842 1.0961 1.0863 1.1005 1.0984 1.0995 1.0896 1.0948 1.0976 1.0450 1.0772 1.0449 1.0969 1.0463 1.0792 1.1045 1.1042
irintensity: 0.5970 0.7759 8.9294 4.0313 0.8693 4.5394 4.2623 1.0259 11.8373 0.0183 1.5187 21.9069 5.3901 11.4851 3.9725 3.3549 19.2690 18.2350 21.4353 11.0262 5.6531 0.8717 4.0068 6.4767 12.3142 2.9143 19.8740 7.2255 22.0227 8.3775 26.6630 143.7151 38.8159 21.1160 11.8225 186.6238 61.5179 10.6058 38.6020 6.3129 54.4535 31.1169 65.7043 14.0351 96.6441 54.9280 45.3543 51.7372 111.4637 87.4999 38.4673 53.0495 3.4978 0.5041 16.3825 15.5589 1.2793 0.4762 8.9959 72.0851 29.3896 11.9232 51.7972 15.1637 10.8713 2.8599 49.1690 20.4736 0.5450 24.8192 13.3330 9.0083 6.3944 18.4103 22.0113 66.5240 29.0743 131.1523 13.5834 53.0210 17.3702 6.1450 62.5820 149.4321 23.1025 4.1456 64.0965 5.0398 133.7511 12.7919 25.4319 18.5925 28.4387 26.6092 44.3428 1.3140 69.7442 15.8406 3.5752 7.0307 14.8263 84.6843 2.6267 145.0409 7.7702 48.1579 20.4225 7.1137 36.6149 47.2547 10.5921 50.1124 98.9246 23.7864 210.3716 32.4106 213.1656 249.7789 36.9647 179.9816 77.1258 105.0153 203.3806 683.9105 290.9950 58.0090 17.7334 320.1135 224.0395 70.7091 4098.7562 11.6291 46.3986 28.3051 13.3889 34.7702 51.8127 30.2118 7.5974 9.0445 15.6395 131.4946 7.4030 6.6053 3.6530 1.3503 15.1994 97.6224 0.6016 54.5580 44.6928 32.7219 35.2691
temp: 298.150 k
press: 1.00000 atm
elementType: 8 8 8 8 8 7 7 7 7 7 7 7 7 6 6 6 6 6 6 6 6 6 6 6 6 6 6 6 6 1 1 1 1 1 1 1 1 1 1 1 1 1 1 1 1 1 1 1 1 1 1 1 1
symmnumber: 1
zpe: 1104071.9 jmol-1
zpe.correction: 0.420519 hartree
zpe.thermalcorrener: 0.448766 hartree
zpe.thermalcorrenthalpy: 0.449710 hartree
zpe.thermalcorrgfe: 0.361804 hartree
zpe.sumelectzpe: -1436.088510 hartree
zpe.sumelectthermal: -1436.060262 hartree
zpe.sumelectthermalent: -1436.059318 hartree
zpe.sumelectthermalfe: -1436.147224 hartree
dipole: -12.1567 7.4432 0.5906
dipole: 14.2666
quadrupole: -170.4165 -119.2417 -180.5063
quadrupole: -0.6280 19.5333 12.2505
quadrupole: -13.6950 37.4798 -23.7848 -0.6280 19.5333 12.2505
hfenergy: -1436.5090284 hartree
pointgroup: C01 [X(C16H24N8O5)]
dipole: 4.9056253 -2.271217 1.5103596 debye
polarizability: 323.0526473|15.656921|227.5274586|-0.7375055|-55.2442341|209.6485524 unknown
InChI: InChI=1S/C16H24N8O5/c17-8(3-5-21-15(19)20)7-11(25)22-9-1-2-12(29-13(9)14(26)27)24-6-4-10(18)23-16(24)28/h1-2,4,6,8-9,12-13,21-22H,3,5,7,17-20H2
charge 0 multiplicity 1
53 atoms
O  -1.414424 -0.287109 -1.949768
O  1.633668 1.902157 1.386406
O  2.109637 -0.434797 -1.467435
O  0.43856 -1.4983 -0.267072
O  -5.337861 0.798092 -1.398603
N  1.020732 2.401562 -0.802633
N  -3.387779 -0.209151 -0.591064
N  5.582838 2.38149 -0.887532
N  -5.494742 -0.482885 0.573799
N  3.922188 -1.380933 0.219207
N  -5.595961 -1.741544 2.52032
N  4.563147 -3.276572 1.505701
N  2.365935 -3.071811 0.669234
C  -0.24148 1.649972 -0.7535
C  -0.138883 0.402412 -1.707552
C  -2.67774 0.405829 -1.781815
C  -1.441072 2.486702 -1.143988
C  4.320287 1.77498 -0.391263
C  -2.569875 1.909226 -1.619594
C  3.319411 2.933496 -0.072826
C  1.928741 2.388658 0.249053
C  4.627851 0.933021 0.873736
C  0.864304 -0.610199 -1.116059
C  5.070072 -0.526084 0.591547
C  -2.735031 -1.01125 0.316119
C  -4.815182 0.071363 -0.497741
C  -3.430399 -1.550487 1.386465
C  -4.83859 -1.245319 1.479549
C  3.618487 -2.563982 0.788433
H  -0.334342 1.304074 0.295778
H  0.25422 0.747766 -2.68454
H  -3.309901 0.166994 -2.654495
H  -1.370292 3.570691 -0.995449
H  1.333033 2.743968 -1.713805
H  3.832597 1.122599 -1.14988
H  -3.468534 2.476781 -1.874862
H  3.288432 3.62242 -0.93968
H  3.701456 3.49862 0.79434
H  5.434177 1.452067 1.429712
H  3.739176 0.908395 1.528932
H  5.831542 -0.552588 -0.216312
H  5.542561 -0.929523 1.507622
H  6.388478 1.746869 -0.853958
H  5.496299 2.822788 -1.810089
H  -1.67211 -1.214635 0.125807
H  -2.919739 -2.188023 2.110743
H  3.201311 -0.995297 -0.495451
H  -5.18991 -2.315286 3.253362
H  -6.585781 -1.502671 2.540807
H  4.273878 -4.006511 2.151155
H  5.554901 -3.077502 1.413222
H  2.209231 -4.066285 0.828361
H  1.554775 -2.457248 0.302657
