program: Gaussian 09
title: 000198316
version: EM64L-G09RevD.01
frameworkgroup: C1[X(C9H13N2O4PS)]
method: RPBEPBE
basis: SDD
operation: Freq
keyword: #p
keyword: freq=noraman
keyword: PBEPBE/SDD
title: #p freq=noraman PBEPBE/SDD
converged: YES YES NO NO
title: Mulliken charges:
elementType: S P O O O O N N C C C C C C C C C H H H H H H H H H H H H H
charge: -0.216683 0.900764 -0.468444 -0.451884 -0.463544 -0.269955 -0.152630 -0.131605 0.274744 -0.252259 -0.263247 0.206426 -0.325660 -0.489323 -0.478029 -0.057200 -0.549499 0.270814 0.270823 0.241829 0.234676 0.239540 0.237485 0.286092 0.238232 0.246878 0.240885 0.234557 0.224143 0.222076
chargesum: 0.00000
title: Mulliken charges with hydrogens summed into heavy atoms:
elementType: S P O O O O N N C C C C C C C C C
charge: -0.216683 0.900764 -0.468444 -0.451884 -0.463544 -0.269955 -0.152630 -0.131605 0.274744 0.018555 0.007576 0.206426 0.150845 0.273794 0.247966 0.177357 -0.103281
polarizability: 2.50530591e+02 -1.08432847e+01 1.54387905e+02 -7.72130283e+00 5.59851890e-02 1.25538665e+02
1716.lowfreq: -3.7398 -0.0023 -0.0015 -0.0015 6.4642 11.9955 22.3771 41.2823 45.7413
frequency: 22.2392 41.2630 45.6427 56.6124 57.4041 77.2430 114.2749 117.4846 126.1369 141.5108 144.4389 151.3540 158.3181 169.9837 204.3089 218.6693 238.4405 292.7105 327.6498 352.5568 361.1323 376.6695 393.1143 429.1880 469.3091 517.0910 529.5909 555.8376 592.6145 637.3703 653.0956 698.4808 711.7866 737.2891 795.7544 820.4698 835.2595 897.2451 935.4677 952.3550 963.6858 964.5513 969.7850 985.5685 986.5965 1010.3451 1094.4598 1114.1671 1123.0612 1130.6944 1138.7509 1150.1684 1175.2868 1208.1072 1232.0539 1266.9405 1282.6208 1303.8990 1342.9907 1376.6141 1418.7510 1424.6685 1434.9497 1448.5888 1459.5936 1462.0810 1470.6709 1480.2076 1515.5441 1576.4870 1665.7044 2983.9980 2996.0554 2999.1226 3068.9707 3087.6663 3093.9162 3107.7453 3122.4255 3134.2409 3139.6495 3175.5769 3196.1262 3204.4622
redmass: 4.9315 3.6909 7.9022 4.0766 3.1308 3.1073 2.8296 3.5956 3.5223 1.5898 2.0328 1.6090 2.7075 4.6444 5.6724 6.5415 6.8794 3.5767 5.2249 4.6252 4.9030 5.3210 5.0071 9.4817 3.3470 6.9955 3.7017 5.6614 4.7460 2.2808 9.0686 11.1431 12.0896 7.1162 7.8017 9.0348 1.5561 2.8301 1.7726 11.6944 1.4484 1.3205 1.8868 3.6910 8.7407 1.2460 1.5078 1.2444 1.2334 1.2831 1.2923 1.6536 4.1880 1.2446 2.3999 5.3625 1.3059 2.1587 2.3751 3.0324 1.1262 1.1207 1.2170 1.0497 1.0498 1.0990 1.0520 1.0537 5.6220 6.7399 4.7740 1.0304 1.0284 1.0585 1.1046 1.1047 1.0608 1.1053 1.0950 1.1029 1.1048 1.0898 1.1003 1.1145
irintensity: 0.3524 0.7816 0.3418 1.8020 1.6327 4.7798 5.3104 0.8253 5.1072 4.3749 6.0382 2.6239 3.6949 7.6892 13.9355 5.0267 3.4763 12.5583 40.6704 1.6503 8.9493 2.4339 22.4851 1.1243 0.8160 51.5305 7.3336 30.1410 105.0476 35.4318 84.6553 62.5651 146.9144 1.7352 109.2544 87.9661 51.7862 59.3833 98.9786 264.2930 59.6330 0.7230 65.3926 12.4614 47.8942 12.4560 6.3439 0.3809 3.7612 1.1650 1.1396 0.5092 6.5294 1.2537 326.7900 55.2485 0.1100 39.6858 149.5313 429.5575 10.9141 6.8982 11.7217 5.6354 16.6395 9.4481 16.6879 14.4355 46.6286 14.8531 3.7215 49.3591 45.1978 14.4945 12.2663 24.1530 9.5794 7.3542 10.2856 14.5632 6.3997 0.7979 1.4779 25.2610
temp: 298.150 k
press: 1.00000 atm
elementType: 16 15 8 8 8 8 7 7 6 6 6 6 6 6 6 6 6 1 1 1 1 1 1 1 1 1 1 1 1 1
symmnumber: 1
zpe: 570887.3 jmol-1
zpe.correction: 0.217440 hartree
zpe.thermalcorrener: 0.237123 hartree
zpe.thermalcorrenthalpy: 0.238067 hartree
zpe.thermalcorrgfe: 0.166951 hartree
zpe.sumelectzpe: -1499.056200 hartree
zpe.sumelectthermal: -1499.036516 hartree
zpe.sumelectthermalent: -1499.035572 hartree
zpe.sumelectthermalfe: -1499.106688 hartree
dipole: 2.5632 2.0653 -0.1684
dipole: 3.2960
quadrupole: -101.0524 -100.6569 -121.6120
quadrupole: -9.1552 -1.5116 4.6233
quadrupole: 6.7214 7.1168 -13.8382 -9.1552 -1.5116 4.6233
hfenergy: -1499.2736391 hartree
pointgroup: C01 [X(C9H13N2O4P1S1)]
dipole: 1.0420187 0.7462406 -0.197163 debye
polarizability: 248.3727113|-16.7009827|155.5101697|-11.2828776|-2.1952473|126.5742791 unknown
InChI: InChI=1S/C9H13N2O4PS/c1-4-7-14-8-5-6-9(11-10-8)15-16(17,12-2)13-3/h4-6H,1,7H2,2-3H3
charge 0 multiplicity 1
30 atoms
S  -3.159457 -0.635285 2.210802
P  -3.202625 -0.244001 0.19229
O  -2.174575 1.143434 -0.358671
O  -3.011673 -1.498522 -0.953417
O  -4.646255 0.387188 -0.48699
O  3.246808 0.556712 -0.036946
N  -0.286944 -0.204096 -0.039288
N  1.075932 -0.37587 0.043114
C  -0.798444 1.030206 -0.268387
C  0.002254 2.196599 -0.438717
C  1.383748 2.031217 -0.36042
C  1.878005 0.713709 -0.112566
C  3.750026 -0.830795 0.241026
C  -2.237986 -2.705936 -0.558553
C  -5.29733 1.526532 0.199127
C  5.237122 -0.720957 0.423105
C  6.13472 -1.491015 -0.239412
H  -0.466297 3.165523 -0.622958
H  2.083565 2.86162 -0.478323
H  3.237424 -1.197201 1.151002
H  3.471089 -1.490154 -0.599875
H  -2.258191 -3.331265 -1.462972
H  -2.733943 -3.219061 0.283691
H  -1.209591 -2.41328 -0.291072
H  -5.452736 1.303002 1.270784
H  -6.264213 1.63519 -0.313023
H  -4.693217 2.442851 0.081113
H  5.575263 0.012444 1.167477
H  7.209536 -1.413725 -0.043719
H  5.820982 -2.224163 -0.99292
