program: Gaussian 09
title: 000198333
version: EM64L-G09RevD.01
frameworkgroup: C1[X(C19H26O9)]
method: RPBEPBE
basis: SDD
operation: Freq
keyword: #pfreq=noraman
keyword: PBEPBE/SDD
title: #p freq=noraman PBEPBE/SDD
converged: NO YES NO NO
title: Mulliken charges:
elementType: O O O O O O O O O C C C C C C C C C C C C C C C C C C C H H H H H H H H H H H H H H H H H H H H H H H H H H
charge: -0.282056 -0.249759 -0.285715 -0.453646 -0.459344 -0.299502 -0.479312 -0.243932 -0.249698 0.270545 0.351996 0.238288 -0.350250 -0.164349 -0.461733 -0.143442 -0.189451 -0.188136 -0.867409 -0.456579 -0.406340 -0.417960 0.518208 0.307286 -0.829991 0.315245 -0.769521 -0.785122 0.270660 0.325538 0.226015 0.214970 0.273266 0.273130 0.322970 0.210822 0.305036 0.233392 0.298051 0.266253 0.240917 0.228665 0.376080 0.370075 0.241488 0.224085 0.236061 0.367765 0.250137 0.250928 0.251075 0.302075 0.235451 0.236774
chargesum: 0.00000
title: Mulliken charges with hydrogens summed into heavy atoms:
elementType: O O O O O O O O O C C C C C C C C C C C C C C C C C C C
charge: -0.282056 -0.249759 -0.285715 -0.077566 -0.089269 -0.299502 -0.111548 -0.243932 -0.249698 0.270545 0.351996 0.238288 -0.079590 0.161189 -0.020747 0.129824 0.083679 0.134834 -0.118159 0.107724 -0.165423 -0.189295 0.518208 0.307286 -0.128357 0.315245 -0.017381 -0.010822
polarizability: 2.61114649e+02 -6.92147827e+00 2.20604237e+02 -2.94206503e-01 1.41235669e+00 1.96526697e+02
1716.lowfreq: -60.7231 -18.9511 -10.6269 -5.8327 0.0004 0.0006 0.0010 28.4261 33.0566
frequency: -60.7155 27.6933 32.9577 41.7435 51.2467 65.9666 72.7943 90.9614 101.1540 109.1864 112.8870 132.6565 139.9954 142.6230 164.9020 171.1239 178.2043 193.4388 202.3307 217.0895 227.5045 233.4049 242.2398 248.3421 252.4076 270.4837 290.2875 301.8592 310.9989 331.1825 346.1787 352.2142 361.3100 385.5701 400.7474 417.2551 442.8686 453.1897 475.0250 491.1626 502.6262 520.8100 531.8934 546.6185 563.0038 571.0182 571.6385 590.1696 599.4132 618.9618 635.3009 655.3155 696.1321 726.7259 749.9118 768.2909 796.3721 809.5464 832.1685 848.9306 852.4679 861.3382 881.0623 884.7196 892.2716 909.8564 918.6240 922.6972 955.7984 957.5935 959.4248 989.1123 999.4488 1003.8325 1006.2082 1012.6062 1018.4325 1040.5197 1045.4981 1046.2820 1054.1695 1054.6891 1060.4314 1075.0902 1090.2038 1118.6548 1134.2623 1139.9078 1151.9228 1162.6870 1175.8304 1186.3897 1192.2861 1193.7297 1196.4968 1204.3531 1228.6560 1241.9454 1255.6533 1280.9365 1283.2172 1288.6120 1301.4884 1330.9211 1336.9670 1351.5149 1357.2885 1363.0711 1367.4185 1373.5363 1377.9109 1380.7045 1384.6067 1386.6842 1388.8972 1391.5163 1396.7443 1454.3588 1455.7915 1457.4387 1459.5407 1466.0559 1466.7252 1472.6960 1477.3752 1478.9337 1504.9908 1643.9019 1654.8404 1703.9312 2965.2713 2975.4132 2996.9964 3000.2270 3006.5823 3008.9123 3034.4008 3038.0409 3039.5606 3067.0453 3085.5339 3088.4941 3088.8398 3090.1828 3093.7908 3097.2746 3099.7727 3099.9104 3115.7786 3119.0775 3139.3652 3139.6088 3175.3664 3410.7483 3475.4938 3602.5384
redmass: 1.0381 8.6310 8.0257 5.0294 5.0846 4.3381 3.5639 5.1091 3.1252 4.1367 5.6712 5.1871 1.2032 1.1403 4.0515 1.8468 3.4573 5.5814 4.2506 2.9158 4.4617 2.1930 3.9238 2.7204 5.2820 2.8393 3.4798 4.5315 2.9513 4.3602 3.1402 2.3466 3.2032 3.9294 3.7472 3.6376 3.4204 3.1981 1.8451 3.9086 4.3624 3.1482 3.2570 4.9638 3.3916 3.5066 3.2244 1.4705 3.1790 4.1443 4.6079 4.1287 4.4166 4.5569 3.4783 3.1848 4.0405 5.2108 4.1445 3.9496 3.4882 2.6434 2.3811 3.1696 2.8215 2.7841 2.8297 2.6837 5.0935 4.5643 2.5519 3.9073 1.9120 2.4643 2.8313 2.7253 2.3077 1.8624 1.6328 1.6132 1.8510 1.7329 2.3200 2.7535 2.3052 1.5710 2.1595 1.8315 2.5978 2.8290 1.5792 1.9548 2.0655 1.8008 2.0192 2.5988 1.9264 1.2939 1.3771 1.6963 1.7301 1.5090 1.2317 1.1976 1.2943 1.3944 1.2043 1.8482 1.4557 1.5561 1.4434 1.3978 1.2302 1.2900 1.2873 1.2564 1.2615 1.0527 1.0635 1.0462 1.0509 1.1074 1.0964 1.0620 1.0929 1.1139 1.0564 10.6163 9.3748 7.4543 1.0389 1.0835 1.0836 1.0369 1.0360 1.0364 1.0855 1.0587 1.0961 1.0544 1.0979 1.0976 1.0892 1.0854 1.0867 1.0972 1.0972 1.1049 1.1003 1.0918 1.1013 1.1014 1.1167 1.0642 1.0655 1.0672
irintensity: 0.9883 0.9130 0.4627 0.7960 2.3338 0.4135 3.9298 2.5937 0.3063 2.3246 2.7927 9.0699 1.6404 1.0885 2.0414 2.2311 3.4505 0.3995 3.2255 45.3000 13.3755 43.4326 11.9113 27.1404 14.6387 0.2397 1.9582 11.6440 4.1110 9.1937 0.1148 11.6614 3.4596 24.6920 9.1313 4.8196 12.8868 5.9078 61.6847 29.5457 14.0604 3.5524 7.1449 4.9522 4.1048 5.5817 1.8697 86.2063 29.0492 31.5583 14.1040 6.3424 10.5031 20.4529 16.2447 9.6263 26.8407 17.0561 29.9050 14.8607 22.9049 8.9379 1.8234 30.7700 12.3293 43.4311 18.5277 45.2394 83.6450 47.6528 48.4531 82.9800 14.6479 111.5246 69.6318 31.2769 59.7445 4.0680 7.2574 3.6810 3.2253 25.7349 2.2406 8.4712 11.1969 8.1351 9.4276 45.5902 6.3349 9.0081 50.7717 56.1509 46.8401 28.4026 191.7232 443.8281 8.3563 45.7705 8.9317 10.2912 6.9907 9.0372 2.5715 13.6254 4.4443 1.1296 34.0856 5.6626 4.2839 1.3638 23.6835 26.2751 52.1027 37.1007 14.1720 24.5240 69.5451 19.4186 3.7748 15.6772 16.2115 16.4501 20.5388 13.9636 26.0757 2.6947 4.6304 228.6604 162.3972 11.0737 27.9658 40.0963 7.9198 23.4494 14.5467 2.9971 13.8606 2.0470 18.6031 25.0211 26.3145 16.0987 20.8776 4.3482 17.6864 4.9433 6.5296 2.4027 0.9607 21.5491 4.7990 14.8829 15.0213 56.9022 19.3669 19.0397
temp: 298.150 k
press: 1.00000 atm
elementType: 8 8 8 8 8 8 8 8 8 6 6 6 6 6 6 6 6 6 6 6 6 6 6 6 6 6 6 6 1 1 1 1 1 1 1 1 1 1 1 1 1 1 1 1 1 1 1 1 1 1 1 1 1 1
symmnumber: 1
zpe: 1126798.7 jmol-1
zpe.correction: 0.429175 hartree
zpe.thermalcorrener: 0.457332 hartree
zpe.thermalcorrenthalpy: 0.458276 hartree
zpe.thermalcorrgfe: 0.371904 hartree
zpe.sumelectzpe: -1414.393792 hartree
zpe.sumelectthermal: -1414.365635 hartree
zpe.sumelectthermalent: -1414.364691 hartree
zpe.sumelectthermalfe: -1414.451062 hartree
dipole: -1.5165 -2.0793 0.9452
dipole: 2.7416
quadrupole: -128.1560 -177.0329 -171.5397
quadrupole: -13.2518 -7.4039 5.2209
quadrupole: 30.7536 -18.1234 -12.6302 -13.2518 -7.4039 5.2209
hfenergy: -1414.8229667 hartree
pointgroup: C01 [X(C19H26O9)]
dipole: -0.1648058 1.063576 -0.0715061 debye
polarizability: 256.7726014|-13.1942591|219.4936386|11.0569044|5.9933211|201.9793431 unknown
InChI: InChI=1S/C19H26O9/c1-8-5-11-18(6-25-9(2)20,14(24)12(8)22)17(4)15(27-10(3)21)13(23)16(28-11)19(17)7-26-19/h5,11-16,22-24H,6-7H2,1-4H3
charge 0 multiplicity 1
54 atoms
O  0.403407 2.472102 2.398047
O  0.058761 2.361856 -0.820696
O  2.958469 -0.729932 0.65801
O  2.215339 1.218137 -2.127715
O  -2.181819 0.216409 2.446527
O  -0.542508 -1.823363 -1.07673
O  -4.09932 0.00865 0.698672
O  2.580127 -2.857701 -0.231996
O  -1.506638 -3.873063 -0.528736
C  0.62903 0.175088 1.026565
C  1.049552 1.635068 1.335961
C  -0.812005 0.228127 0.307279
C  1.305442 2.246991 -0.032445
C  1.761928 -0.169202 -0.043632
C  1.853821 2.071108 2.51893
C  2.239504 1.182755 -0.670087
C  -0.674555 1.048284 -1.013624
C  -1.884965 0.94725 1.211439
C  0.658785 -0.776559 2.234779
C  -1.369354 -1.179846 -0.018891
C  -3.241087 1.227317 0.492801
C  -1.975885 1.450377 -1.652707
C  -3.153983 1.54895 -0.985741
C  3.26058 -2.082483 0.47611
C  -4.446355 1.958235 -1.660153
C  -0.705994 -3.213894 -1.227689
C  4.510226 -2.462049 1.241143
C  0.218584 -3.742592 -2.296246
H  1.716894 3.267427 -0.01437
H  1.423559 -0.897853 -0.795852
H  2.063798 1.363043 3.327066
H  2.567501 2.898414 2.409114
H  3.284768 1.353842 -0.357281
H  -0.089049 0.441056 -1.730773
H  -1.474298 1.918424 1.523587
H  1.637709 -0.730034 2.739539
H  -0.140062 -0.514123 2.945387
H  0.510136 -1.823484 1.91829
H  -2.403414 -1.118338 -0.394488
H  -1.376682 -1.827488 0.872291
H  -3.725378 2.06903 1.030498
H  -1.932999 1.710594 -2.718003
H  1.461177 1.810905 -2.395889
H  -2.991345 -0.3334 2.241934
H  -4.276745 2.277346 -2.702108
H  -4.930753 2.796472 -1.121011
H  -5.168997 1.119274 -1.680374
H  -5.043151 0.281659 0.803298
H  4.264214 -3.253677 1.970264
H  4.940575 -1.596417 1.764283
H  5.252573 -2.882395 0.540969
H  1.249182 -3.729349 -1.899338
H  0.193739 -3.098626 -3.190911
H  -0.066439 -4.772027 -2.557599
