program: Gaussian 09
title: 000198302
version: EM64L-G09RevD.01
frameworkgroup: C1[X(C14H16ClN2O4PS)]
method: RPBEPBE
basis: SDD
operation: Freq
keyword: #p
keyword: freq=noraman
keyword: PBEPBE/SDD
title: #p freq=noraman PBEPBE/SDD
converged: NO YES NO NO
title: Mulliken charges:
elementType: Cl S P O O O O N N C C C C C C C C C C C C C C H H H H H H H H H H H H H H H H
charge: -0.057163 -0.215436 0.895332 -0.471798 -0.461349 -0.461750 -0.293490 -0.138611 -0.157459 -0.213879 -0.241426 0.274048 -0.653513 -0.647218 -0.250115 0.222063 0.332922 -0.274124 -0.389461 -0.269230 -0.180809 -0.205374 -0.115777 0.227716 0.228149 0.232287 0.260681 0.209406 0.236322 0.236102 0.212765 0.241742 0.231390 0.273285 0.275932 0.261853 0.330151 0.259501 0.256334
chargesum: 0.00000
title: Mulliken charges with hydrogens summed into heavy atoms:
elementType: Cl S P O O O O N N C C C C C C C C C C C C C C
charge: -0.057163 -0.215436 0.895332 -0.471798 -0.461349 -0.461750 -0.293490 -0.138611 -0.157459 0.241986 0.251542 0.274048 0.028317 0.038678 0.023170 0.222063 0.332922 0.001808 -0.127608 0.060920 0.078691 0.050960 -0.115777
polarizability: 3.75087814e+02 -1.93067078e+01 2.34999290e+02 6.74916368e-01 8.77820705e+00 1.43729858e+02
1716.lowfreq: -16.7164 -2.4145 -0.0017 -0.0013 0.0014 1.6449 13.7963 18.8768 26.0002
frequency: 12.0940 17.4108 25.9793 30.2250 33.9521 47.0358 52.1489 60.8217 73.8130 93.2670 104.3644 111.9133 137.8820 149.4645 167.7118 193.5544 214.3906 225.2917 228.8374 240.4117 276.7405 294.5525 310.3313 318.3370 326.7217 352.1439 368.6685 405.1691 412.6944 415.9060 427.4082 451.3136 495.9953 509.9858 520.0656 570.8521 596.0384 618.9424 627.5233 670.8220 686.0961 695.8814 717.1851 730.7067 742.5130 789.4665 810.9332 819.2660 821.6583 834.3342 839.5313 859.9592 864.2559 891.2577 949.1900 966.0162 978.6934 980.0385 995.4339 1002.3408 1022.7351 1068.1474 1089.9499 1094.1302 1102.7774 1106.5448 1134.1953 1146.1984 1148.2235 1168.0364 1182.4945 1235.8812 1256.0448 1258.7848 1274.2578 1288.2503 1319.7628 1344.2994 1356.8029 1365.2531 1375.2023 1389.1785 1395.7212 1399.9958 1456.7282 1458.5226 1463.8342 1470.5479 1477.9129 1484.0070 1487.8576 1509.3989 1574.1205 1582.8611 1600.2257 2988.4116 2990.0517 2997.7988 3025.9229 3056.8986 3084.5376 3088.1735 3094.2891 3112.9343 3114.1316 3162.5705 3167.7084 3176.8731 3182.2590 3197.2076 3201.1565
redmass: 5.3553 4.2008 4.0066 2.8770 4.1699 5.7919 2.3463 4.6688 4.3549 5.5649 5.1197 7.9004 5.5303 10.2212 5.7225 5.8584 6.5989 1.4447 4.1786 1.3778 6.4685 3.2764 4.9214 6.6316 5.0030 5.3173 7.1888 5.2510 4.2218 3.3222 7.8827 7.4318 2.9255 9.5675 3.7326 9.4346 8.6626 9.2052 8.4172 8.7697 6.2990 3.9262 7.2896 6.8307 8.8141 1.1323 1.1004 1.3337 8.7323 1.5346 1.3890 7.4895 4.7381 3.8109 1.3341 1.3204 1.3603 3.6505 4.3621 2.4842 2.7771 2.4736 1.7258 2.1458 1.3014 2.2188 1.4268 1.5458 2.0066 2.8823 1.7132 2.6353 1.1410 1.1175 3.0502 1.5153 7.1707 1.2730 1.2690 3.3559 7.3147 1.2355 1.2439 3.6341 1.0396 1.0416 2.3517 1.0697 1.0547 1.0584 1.0782 5.5441 6.7868 7.4859 7.0724 1.0363 1.0543 1.0384 1.0596 1.1080 1.0972 1.1042 1.0981 1.1023 1.1054 1.0887 1.0915 1.0900 1.0976 1.1004 1.0953
irintensity: 0.1871 0.3873 0.1277 0.8256 0.2276 0.1836 3.1676 4.3253 0.6223 1.3388 2.5501 3.8482 5.3715 1.5936 8.0699 1.0444 3.1973 0.1815 19.2657 0.6939 11.0881 6.4447 7.8591 4.3233 0.7169 1.5398 17.8409 25.7782 2.9219 0.1231 0.7326 62.5275 19.9407 22.2049 5.3319 61.9996 62.4697 66.0301 40.5340 67.9179 40.4498 0.0072 117.5333 2.2723 57.7174 6.2053 2.6000 32.9014 168.3056 58.0794 47.9210 16.4461 237.6082 133.7810 1.2657 0.0415 3.0056 19.3686 59.5178 159.3476 104.0428 60.2959 6.6632 7.7550 19.2835 6.1955 4.8515 8.2756 39.4463 1.7434 16.7453 449.2567 0.4971 9.2706 67.1498 23.1844 50.0887 11.4470 38.8784 796.3542 4.1083 28.1775 25.8185 41.1429 12.5454 11.4553 353.7098 4.3829 5.4158 12.3133 11.5466 42.5282 17.1136 10.5277 0.9467 21.4946 21.4856 27.5222 11.9324 12.8953 22.1458 5.0130 24.8162 29.7871 23.4589 2.5541 1.8621 0.6146 2.0651 0.9532 23.4423
temp: 298.150 k
press: 1.00000 atm
elementType: 17 16 15 8 8 8 8 7 7 6 6 6 6 6 6 6 6 6 6 6 6 6 6 1 1 1 1 1 1 1 1 1 1 1 1 1 1 1 1
symmnumber: 1
zpe: 741058.7 jmol-1
zpe.correction: 0.282254 hartree
zpe.thermalcorrener: 0.307038 hartree
zpe.thermalcorrenthalpy: 0.307982 hartree
zpe.thermalcorrgfe: 0.222176 hartree
zpe.sumelectzpe: -2151.078120 hartree
zpe.sumelectthermal: -2151.053336 hartree
zpe.sumelectthermalent: -2151.052392 hartree
zpe.sumelectthermalfe: -2151.138198 hartree
dipole: 1.4492 -3.6386 -0.6601
dipole: 3.9718
quadrupole: -157.2902 -135.0320 -165.1822
quadrupole: 1.4997 4.2673 -2.8986
quadrupole: -4.7887 17.4695 -12.6807 1.4997 4.2673 -2.8986
hfenergy: -2151.3603743 hartree
pointgroup: C01 [X(C14H16Cl1N2O4P1S1)]
dipole: 0.4925038 1.4122792 0.4524065 debye
polarizability: 372.326256|27.761233|233.5385951|-1.4644737|20.8773127|147.9521111 unknown
InChI: InChI=1S/C14H16ClN2O4PS/c1-3-18-22(23,19-4-2)21-14-10-9-13(16-17-14)20-12-7-5-11(15)6-8-12/h5-10H,3-4H2,1-2H3
charge 0 multiplicity 1
39 atoms
Cl -7.151981 -2.244767 -0.384192
S  3.306396 -0.796853 -2.172468
P  3.624354 -0.425038 -0.17169
O  5.20753 -0.034528 0.352052
O  3.318416 -1.603241 1.024338
O  2.882011 1.117558 0.439614
O  -2.563286 1.580132 0.449448
N  0.7684 0.131949 0.228565
N  -0.60603 0.211377 0.223962
C  5.985452 0.977354 -0.429582
C  2.316756 -2.693112 0.75663
C  1.508826 1.251291 0.433527
C  7.402165 0.934211 0.132617
C  3.014096 -3.92435 0.181498
C  0.942324 2.540125 0.657537
C  -1.185326 1.421887 0.433855
C  -3.551072 0.576355 0.236441
C  -0.447603 2.624379 0.659563
C  -4.866699 1.085043 0.346113
C  -3.31417 -0.786106 -0.061621
C  -5.968297 0.22795 0.157785
C  -4.424679 -1.641752 -0.250919
C  -5.729398 -1.129542 -0.139423
H  5.952552 0.703865 -1.501833
H  5.513011 1.966977 -0.287644
H  1.895406 -2.880012 1.758077
H  1.522676 -2.295819 0.100351
H  8.034561 1.671937 -0.395152
H  7.402273 1.178181 1.208182
H  7.844209 -0.067378 -0.000025
H  2.284441 -4.751584 0.092693
H  3.423272 -3.715294 -0.821655
H  3.834338 -4.255241 0.841248
H  1.587299 3.406322 0.818052
H  -0.980788 3.563673 0.821643
H  -5.012267 2.144174 0.576346
H  -2.292989 -1.159009 -0.139808
H  -6.98961 0.609241 0.240079
H  -4.26237 -2.698157 -0.483303
