program: Gaussian 09
title: 000198212
version: EM64L-G09RevD.01
frameworkgroup: C1[X(C9H9NO3)]
method: RPBEPBE
basis: SDD
operation: Freq
keyword: #pfreq=noraman
keyword: PBEPBE/SDD
title: #p freq=noraman PBEPBE/SDD
converged: YES YES NO NO
title: Mulliken charges:
elementType: O O O N C C C C C C C C C H H H H H H H H H
charge: -0.488703 -0.213621 -0.275449 -0.641491 0.324758 0.123452 -0.470121 0.262707 -0.320916 -0.402664 0.120473 0.153882 -0.789504 0.327755 0.247793 0.221820 0.235338 0.235464 0.264633 0.378708 0.376591 0.329093
chargesum: 0.00000
title: Mulliken charges with hydrogens summed into heavy atoms:
elementType: O O O N C C C C C C C C C
charge: -0.109995 -0.213621 -0.275449 0.064193 0.324758 0.123452 -0.142366 0.262707 -0.073123 -0.180844 0.120473 0.153882 -0.054068
polarizability: 1.66379747e+02 -6.44586887e+00 1.32506839e+02 -3.36924205e-02 7.04855147e-03 5.09736235e+01
1716.lowfreq: -7.0229 0.0004 0.0006 0.0006 6.4733 7.4091 49.2358 61.1545 104.6553
frequency: 49.2248 61.1531 104.6549 140.1642 143.4915 152.2915 259.0928 292.2051 318.1562 347.9856 370.1322 381.0799 427.7602 460.2804 503.3563 534.7136 556.6550 575.5523 593.1842 631.4278 669.5625 677.4455 710.5612 738.3030 769.3227 808.0637 858.3169 942.6635 958.8534 1000.1860 1030.9914 1057.5541 1086.6457 1095.5882 1143.5231 1172.6715 1232.8701 1255.3251 1287.3157 1341.0733 1368.0271 1400.7903 1418.6763 1447.3278 1463.5925 1484.9317 1570.5050 1581.8914 1605.9465 1619.6123 1633.3764 2984.0545 3068.4232 3114.8753 3126.5133 3157.4982 3162.7733 3470.7865 3591.4516 3650.0258
redmass: 5.0425 5.2249 5.2878 1.2301 6.2928 2.9219 4.7285 4.9049 4.7384 6.8678 1.1486 5.2603 3.1859 5.0770 3.2305 4.0740 4.8268 1.7732 3.6404 1.7123 5.6539 1.1409 3.4494 5.5482 4.9951 1.4977 6.0497 1.3727 1.9780 1.4064 1.7771 2.1311 3.2414 1.9747 1.6625 1.1597 2.3334 3.2705 1.6484 3.2510 1.2616 7.9168 4.7460 1.0980 1.0499 2.6384 3.1018 5.4518 2.3942 3.6108 5.6827 1.0377 1.0971 1.0896 1.0988 1.0911 1.0943 1.0482 1.0662 1.1026
irintensity: 1.4415 6.4444 0.4001 0.7645 0.7826 0.2964 14.7090 6.3405 5.7540 4.3056 125.8734 8.2785 4.5423 4.2425 2.3040 35.5017 17.8102 18.9145 7.3112 202.1540 0.3395 117.8627 1.3643 8.3291 5.1947 56.9272 9.1082 1.6092 20.7102 15.6683 0.0787 64.4984 43.2433 3.7592 78.2364 1.6130 11.9616 451.6150 7.3630 101.2065 94.9219 6.2589 10.5256 29.3332 21.2141 24.5256 141.7624 62.1827 108.5886 126.9474 281.7978 3.9517 13.7091 16.3194 14.0687 7.6097 10.6581 56.8024 61.6981 79.2928
temp: 298.150 k
press: 1.00000 atm
elementType: 8 8 8 7 6 6 6 6 6 6 6 6 6 1 1 1 1 1 1 1 1 1
symmnumber: 1
zpe: 434606.2 jmol-1
zpe.correction: 0.165533 hartree
zpe.thermalcorrener: 0.177719 hartree
zpe.thermalcorrenthalpy: 0.178663 hartree
zpe.thermalcorrgfe: 0.126868 hartree
zpe.sumelectzpe: -627.861353 hartree
zpe.sumelectthermal: -627.849166 hartree
zpe.sumelectthermalent: -627.848222 hartree
zpe.sumelectthermalfe: -627.900018 hartree
dipole: -1.5128 8.7282 0.0125
dipole: 8.8583
quadrupole: -61.6913 -76.8605 -77.8479
quadrupole: 0.2919 0.0050 -0.0640
quadrupole: 10.4419 -4.7272 -5.7147 0.2919 0.0050 -0.0640
hfenergy: -628.0268856 hartree
pointgroup: C01 [X(C9H9N1O3)]
dipole: -0.9515563 -3.1940512 1.0191442 debye
dipolederiv: -1.3267619 -0.4592567 0.2414082 -0.3978613 -0.3680727 0.0324716 0.2224949 0.0399592 -0.4572958 -0.7932979 -0.1097142 0.0899109 -0.3634888 -0.7793338 0.1757281 0.1618487 0.145214 -0.3712668 -0.6676528 0.0767961 0.0130796 -0.0354745 -0.9877641 0.1779255 0.0448753 0.1654584 -0.423162 -1.1857841 -0.1213741 0.0932476 -0.01962 -0.4194471 -0.0730387 0.0639132 -0.0609255 -0.6752047 -0.8544989 -0.0716442 0.1192668 -0.0338605 -0.2606531 0.0663165 0.1091351 0.0711594 -0.0741615 -0.4209627 0.0995325 0.0214357 -0.0427254 -0.364293 0.1066329 0.062542 0.0892634 -0.0407591 0.2654484 -0.0337291 -0.0282886 -0.0737172 -0.0079113 -0.0027871 -0.0174 -0.0076752 -0.0439165 1.1656842 0.4665916 -0.2648683 0.2292083 0.349527 -0.1047943 -0.1966857 -0.1329972 0.1402975 0.2191418 0.0910675 -0.0660404 0.172483 0.1311238 -0.089973 -0.0882028 -0.0799992 -0.0771432 -0.5641983 -0.103483 0.0750185 0.2375558 0.0447311 -0.0954757 -0.0228314 -0.0543309 -0.1708568 1.7663944 0.0776487 -0.2226575 0.2072759 0.8447684 -0.2272155 -0.2596068 -0.2124234 0.2149732 1.57522 -0.1608001 -0.1125576 -0.1485074 1.2068312 -0.2568534 -0.1164562 -0.2562695 0.3183861 -0.3849572 0.2056879 -0.0038654 0.3238609 -0.2088496 0.0355382 -0.0381489 0.0504599 0.0475463 0.18488 -0.0306543 0.0042166 -0.0243222 0.1141859 0.0124635 0.0023995 0.013132 0.1428889 0.0138506 0.1014545 -0.0136076 0.1054721 0.0296596 0.0189766 -0.01484 0.0195409 0.1372235 0.026493 -0.073665 0.0386371 -0.0554698 -0.0812066 0.0788565 0.0333241 0.0810597 0.1443118 0.080917 -0.046637 -0.0592841 -0.0208363 -0.0219416 -0.093781 -0.0295478 -0.0947573 0.0389155 0.0995477 0.006858 0.0412053 0.0126699 0.0791426 0.0633107 0.0027475 0.0681559 -0.0802986 -0.0701443 -0.0357209 0.0343857 -0.106996 0.0688297 0.028552 0.0548297 0.0194875 0.1097122 0.3708789 0.1572739 -0.0423946 0.115902 0.1466699 0.0577711 -0.0299607 0.0530147 0.3838668 0.2873217 -0.0523524 0.0267233 -0.0860349 0.3246859 0.0279836 0.036951 0.0235917 0.3769773 0.2124804 0.0161201 0.0150287 0.0044864 0.1593175 0.0613917 0.0186196 0.0598815 0.3589657 unknown
polarizability: 165.8107457|-1.0590496|125.4427119|-13.5692562|-21.0638596|58.6067518 unknown
InChI: InChI=1S/C9H9NO3/c1-5(11)6-2-3-8(12)7(4-6)9(10)13/h2-4,12H,10H2,1H3
charge 0 multiplicity 1
22 atoms
O  -2.419292 -1.197096 0.657192
O  3.221824 1.577305 -0.812409
O  -1.489558 2.782503 -0.58632
N  -3.169112 1.307143 0.028972
C  1.5862 -0.063585 -0.151038
C  -0.821657 0.518568 -0.025127
C  0.522644 0.862996 -0.286327
C  -1.088286 -0.81906 0.388852
C  1.285027 -1.388565 0.263714
C  -0.042776 -1.762732 0.531673
C  2.988774 0.388104 -0.449902
C  -1.848399 1.621824 -0.215598
C  4.129504 -0.617323 -0.307301
H  0.73448 1.889591 -0.604789
H  2.080485 -2.131122 0.379336
H  -0.271446 -2.787775 0.851966
H  3.982689 -1.486171 -0.975969
H  4.197935 -1.000093 0.72834
H  5.075653 -0.120043 -0.568167
H  -2.477603 -2.143097 0.937444
H  -3.441041 0.367779 0.327273
H  -3.858145 2.047051 -0.098818
