program: Gaussian 09
title: 000198239
version: EM64L-G09RevD.01
frameworkgroup: C1[X(C23H32NO)]
method: RPBEPBE
basis: SDD
operation: Freq
keyword: #p
keyword: freq=noraman
keyword: PBEPBE/SDD
title: #p freq=noraman PBEPBE/SDD
converged: NO YES NO NO
title: Mulliken charges:
elementType: O N C C C C C C C C C C C C C C C C C C C C C C C H H H H H H H H H H H H H H H H H H H H H H H H H H H H H H H H
charge: -0.303976 -0.110049 0.020296 -0.363852 -0.440766 -0.373765 -0.426037 -0.416653 -0.584015 -0.735033 -0.481990 -0.226233 0.447632 -0.442723 -0.381686 0.264337 -0.230199 -0.232672 0.284905 -0.232232 -0.332064 -0.377259 -0.786809 -0.245773 -0.241358 0.251314 0.261203 0.252427 0.244068 0.235630 0.296245 0.257751 0.254989 0.253338 0.213455 0.258046 0.259026 0.268557 0.272967 0.262739 0.236439 0.244573 0.257876 0.241457 0.228837 0.241836 0.266256 0.243820 0.244200 0.248947 0.248062 0.241893 0.228419 0.230275 0.230939 0.233686 0.238702
chargesum: 1.00000
title: Mulliken charges with hydrogens summed into heavy atoms:
elementType: O N C C C C C C C C C C C C C C C C C C C C C C C
charge: -0.303976 -0.110049 0.271610 0.149778 0.038933 0.180232 0.082290 0.054849 0.216535 0.008718 0.017343 0.002604 0.447632 -0.200887 -0.115430 0.264337 0.013621 0.011528 0.284905 0.016715 -0.084002 -0.135367 -0.097175 -0.012088 -0.002656
polarizability: 2.74279534e+02 1.37956549e+01 2.40069766e+02 1.55593320e+00 1.53857154e+01 2.19527598e+02
1716.lowfreq: -22.7508 -9.8991 -5.1484 -0.0004 -0.0003 0.0004 4.1294 22.5125 28.7589
frequency: -18.8148 22.2390 28.6446 35.6217 43.1642 52.0344 63.1037 99.3224 113.6537 123.1557 136.5255 153.0107 169.8793 202.1173 208.0134 211.9667 218.0344 229.2578 247.0626 278.0993 295.6204 320.2724 330.4361 349.6129 363.0290 389.2983 402.9194 410.0433 428.9307 439.3847 459.0509 468.2972 487.6555 509.4043 536.6894 539.1036 553.7500 568.7252 604.6039 612.0074 616.4282 679.0875 709.7818 712.5039 744.4650 745.4197 755.2360 761.6207 776.8859 811.2031 815.1595 823.5258 844.3620 845.7809 864.1523 864.4620 894.4206 921.1040 930.3223 931.2323 932.7719 980.2261 982.0464 983.3923 984.7958 986.9532 989.3350 998.0778 1007.5574 1015.0776 1021.7904 1037.8300 1046.5399 1050.5341 1062.2920 1072.6797 1083.2236 1094.7236 1111.0988 1113.6053 1123.3119 1125.2345 1152.2140 1172.3664 1178.1104 1179.7859 1180.2147 1185.4414 1192.6726 1200.6395 1221.8437 1227.6191 1229.7865 1269.3798 1275.6756 1281.3506 1288.8302 1302.5259 1306.9827 1310.9216 1329.2306 1345.3755 1347.2235 1354.1847 1355.1912 1363.9036 1367.3627 1377.5408 1381.8365 1385.7210 1400.8486 1406.0074 1430.4127 1433.3850 1442.5005 1455.2577 1461.6392 1462.2174 1467.1400 1469.3520 1471.5689 1475.0993 1476.2482 1479.7952 1480.0641 1484.2310 1485.2412 1491.4929 1497.2271 1592.4845 1597.0974 1607.9054 1610.2310 2950.5458 2981.9423 2991.1241 2994.7829 3002.9282 3004.5644 3006.6884 3014.7426 3021.7212 3029.3921 3040.4036 3057.3348 3057.8243 3060.2599 3074.8028 3079.8439 3093.0877 3095.7715 3100.5207 3104.1986 3107.1423 3120.8030 3132.1761 3132.5859 3140.2092 3143.0066 3143.4435 3151.7694 3154.1994 3162.8068 3171.5872 3175.7443
redmass: 3.7736 4.3762 3.9523 4.4975 3.6158 3.9524 3.6872 1.1310 2.2168 2.8445 3.1133 3.7934 3.2055 2.7689 1.9216 3.2179 1.2852 1.9917 1.7498 4.3202 2.0308 2.6919 2.5517 2.0607 3.1289 2.8606 2.8652 3.6263 2.9445 2.8565 3.0484 3.0599 3.9985 2.9903 3.5229 3.4193 1.9585 3.7344 5.0177 4.8609 5.8448 3.0167 1.9415 2.3141 3.0570 2.0004 1.4855 3.0035 1.9166 1.7789 4.3678 1.8229 2.0170 1.4544 1.2439 2.1287 1.8240 1.9547 2.0298 1.3954 1.3886 2.4213 1.3861 1.9271 1.9466 1.8930 4.6451 1.5280 1.3636 1.8896 2.3995 2.1223 1.5292 2.1081 1.9913 2.3368 1.9187 1.7707 1.9099 2.1524 1.8850 1.7536 1.6106 1.7130 1.0718 1.8582 1.2795 1.2021 1.4887 2.2222 1.5226 2.2656 1.6807 1.2375 1.2377 1.2377 1.4421 1.4040 1.2706 1.1763 1.2748 1.2795 1.3626 1.3478 1.5388 1.4953 1.3538 1.3451 6.3740 4.7588 1.2618 1.2026 1.9825 1.1588 2.0917 1.0781 1.0479 1.0679 1.0844 1.0661 1.1109 1.3531 1.0837 1.1811 1.7787 1.9667 1.0646 1.0684 1.0670 6.0311 6.1684 6.1117 6.8313 1.0841 1.0371 1.0677 1.0795 1.0446 1.0627 1.0608 1.0587 1.0623 1.0349 1.0617 1.0970 1.0996 1.0976 1.1005 1.1023 1.0977 1.0994 1.1023 1.0892 1.1007 1.1029 1.0872 1.0872 1.1041 1.0895 1.0902 1.1043 1.0955 1.0937 1.1012 1.0992
irintensity: 0.1382 0.3543 0.1675 0.3521 0.1235 0.4009 1.0817 0.3041 0.0941 1.5749 0.6583 2.6048 0.6710 3.3827 1.2641 1.8322 0.0811 2.5786 2.3164 0.1922 0.3660 0.2556 0.6731 0.1580 1.2747 0.7219 0.2311 1.1027 0.2020 5.0472 0.4587 1.0399 2.2927 3.6679 0.0819 9.7980 3.3119 4.4182 6.2222 11.4034 0.8156 7.7986 53.1153 19.1238 3.9739 8.7772 81.1829 31.7006 44.6416 12.7957 11.1234 1.2913 3.3411 2.1186 0.2615 29.5382 6.3543 18.4180 0.8617 12.4391 4.3132 4.1483 1.8716 23.2328 23.7954 23.6012 10.6966 3.5452 0.4897 8.5211 12.2409 7.6647 6.7295 20.7160 35.3178 6.7169 4.2829 0.1889 1.5456 126.5622 1.1550 2.2162 3.3048 87.2291 0.9403 6.6208 23.3792 4.2779 1.2715 15.6927 13.6152 56.0948 20.8846 7.9044 6.0487 2.2455 0.7978 12.9991 2.5988 18.9592 18.5833 2.5396 15.2411 0.5104 0.1989 5.4614 6.0871 1.0673 2.2135 4.8375 14.9521 26.5456 27.7000 17.8340 15.8391 0.6121 13.7912 13.8129 21.8341 10.5974 5.1495 10.6224 19.1751 7.5570 12.8278 102.5507 50.7847 15.8530 14.6277 2.7344 25.8563 1.3424 13.3899 25.3824 26.8441 18.6553 0.9773 1.6876 9.8101 21.3246 5.0845 12.5937 8.2972 6.6524 20.3361 12.9386 13.9614 25.0910 12.1439 11.2415 23.0213 13.9866 12.3332 19.3129 6.3481 1.4035 6.1373 8.8119 6.7550 3.1879 4.5595 15.3230 31.5488 12.8126 8.6635
temp: 298.150 k
press: 1.00000 atm
elementType: 8 7 6 6 6 6 6 6 6 6 6 6 6 6 6 6 6 6 6 6 6 6 6 6 6 1 1 1 1 1 1 1 1 1 1 1 1 1 1 1 1 1 1 1 1 1 1 1 1 1 1 1 1 1 1 1 1
symmnumber: 1
zpe: 1309870.9 jmol-1
zpe.correction: 0.498903 hartree
zpe.thermalcorrener: 0.522800 hartree
zpe.thermalcorrenthalpy: 0.523745 hartree
zpe.thermalcorrgfe: 0.444879 hartree
zpe.sumelectzpe: -1023.501002 hartree
zpe.sumelectthermal: -1023.477105 hartree
zpe.sumelectthermalent: -1023.476161 hartree
zpe.sumelectthermalfe: -1023.555027 hartree
dipole: 13.3369 -3.1924 0.5054
dipole: 13.7230
quadrupole: -83.6708 -123.5063 -132.2220
quadrupole: -12.7370 2.1499 1.4781
quadrupole: 29.4622 -10.3733 -19.0889 -12.7370 2.1499 1.4781
hfenergy: -1023.9999053 hartree
pointgroup: C01 [X(C23H32N1O1)]
dipole: -5.1736762 -1.5213446 -0.2609037 debye
polarizability: 275.247199|-11.2521116|236.275862|5.1230027|-17.0264711|222.3538369 unknown
InChI: InChI=1S/C23H32NO/c1-19-11-7-8-15-22(19)25-23(21-13-5-4-6-14-21)16-18-24(3)17-10-9-12-20(24)2/h4-8,11,13-15,20,23H,9-10,12,16-18H2,1-3H3
charge 1 multiplicity 1
57 atoms
O  1.818047 -0.923016 0.464865
N  -3.052772 -1.681387 -0.012795
C  -4.325294 -1.292704 -0.876998
C  -3.335449 -1.252816 1.452221
C  -4.645117 0.212779 -0.738822
C  -1.782909 -1.007006 -0.574914
C  -3.637438 0.243441 1.59767
C  -4.842808 0.656849 0.726604
C  -2.875259 -3.196698 -0.018245
C  -4.206623 -1.728941 -2.345853
C  -0.486139 -1.317828 0.187834
C  0.689702 -0.451109 -0.347664
C  0.421395 1.045624 -0.189356
C  0.048246 1.831093 -1.308409
C  0.503007 1.653055 1.088805
C  3.147219 -0.630955 0.037842
C  -0.251963 3.204252 -1.153634
C  0.207971 3.025533 1.243889
C  4.162804 -1.23154 0.833334
C  -0.17596 3.803157 0.125111
C  3.455022 0.17325 -1.081233
C  5.505887 -0.996613 0.458712
C  3.804907 -2.088682 2.030873
C  4.809406 0.38593 -1.429041
C  5.837788 -0.198722 -0.66172
H  -5.131977 -1.873824 -0.386336
H  -2.465155 -1.560415 2.05323
H  -4.203301 -1.858936 1.771377
H  -5.571898 0.391287 -1.314814
H  -3.862409 0.820311 -1.231788
H  -1.963972 0.077572 -0.579147
H  -1.699112 -1.345163 -1.621764
H  -2.745444 0.851405 1.356982
H  -3.853959 0.429137 2.665953
H  -5.766099 0.196955 1.131622
H  -4.9872 1.75003 0.771893
H  -3.849318 -3.673001 0.173614
H  -2.481848 -3.524536 -0.990403
H  -2.166267 -3.479034 0.773572
H  -5.187345 -1.56073 -2.824507
H  -3.47175 -1.128184 -2.908253
H  -3.974298 -2.798953 -2.474673
H  -0.188043 -2.375978 0.085851
H  -0.575294 -1.0903 1.26508
H  0.871292 -0.691282 -1.418396
H  0.019431 1.379531 -2.309611
H  0.839054 1.058452 1.94618
H  -0.522846 3.80775 -2.026619
H  0.293947 3.494154 2.230177
H  -0.392691 4.869762 0.245884
H  2.671017 0.657573 -1.669141
H  6.303653 -1.45103 1.057485
H  3.16268 -2.939993 1.738691
H  4.712921 -2.488551 2.511817
H  3.240445 -1.510514 2.786029
H  5.051411 1.013117 -2.29351
H  6.887004 -0.034956 -0.926945
