program: Gaussian 09
title: 000198109
version: EM64L-G09RevD.01
frameworkgroup: C1[X(C9H15N2O4PS)]
method: RPBEPBE
basis: SDD
operation: Freq
keyword: #p
keyword: freq=noraman
keyword: PBEPBE/SDD
title: #p freq=noraman PBEPBE/SDD
converged: YES YES NO NO
title: Mulliken charges:
elementType: S P O O O O N N C C C C C C C C C H H H H H H H H H H H H H H H
charge: -0.223910 0.899135 -0.462449 -0.473259 -0.465818 -0.272423 -0.149118 -0.126512 -0.242016 -0.213015 0.274630 -0.648912 -0.654793 -0.252186 -0.247911 0.189641 -0.503574 0.229083 0.266098 0.226431 0.227860 0.211061 0.242959 0.229808 0.208083 0.235654 0.235421 0.270435 0.270101 0.245343 0.232058 0.242092
chargesum: 0.00000
title: Mulliken charges with hydrogens summed into heavy atoms:
elementType: S P O O O O N N C C C C C C C C C
charge: -0.223910 0.899135 -0.462449 -0.473259 -0.465818 -0.272423 -0.149118 -0.126512 0.253166 0.241277 0.274630 0.034916 0.024365 0.018249 0.022190 0.189641 0.215919
polarizability: 2.30261819e+02 -7.26701855e+00 1.69228807e+02 1.57257957e+00 6.83276811e+00 1.28163663e+02
1716.lowfreq: -8.1018 -0.0025 -0.0024 -0.0015 0.2519 4.2716 27.8171 33.2408 42.2803
frequency: 27.7573 33.1577 42.2612 45.4410 53.4754 66.9405 82.7809 100.8029 112.4614 135.8802 139.2510 160.4703 171.2546 208.0681 223.4251 226.7319 229.0816 247.5257 296.3558 311.3171 355.3967 358.6005 401.9319 413.6809 429.8630 463.8366 516.8114 529.2141 548.8012 593.9169 652.5533 684.8114 716.4067 736.7316 755.9934 793.4422 811.4175 820.1621 833.9537 863.4553 891.2706 957.6601 963.1567 982.3311 1002.9811 1023.3936 1088.3294 1094.6178 1106.8435 1113.2375 1134.1866 1147.1241 1148.1948 1177.2055 1234.4626 1254.4214 1259.3703 1269.5894 1325.2295 1342.6760 1355.3447 1362.5068 1391.8968 1395.7243 1439.5353 1447.7966 1456.6188 1459.9503 1463.8783 1473.2521 1477.6370 1485.3796 1488.0999 1516.9523 1577.0108 2987.9277 2989.0463 2997.3807 3002.6218 3025.2715 3055.9631 3083.6208 3087.4106 3093.8658 3104.5212 3112.2404 3113.5880 3145.5831 3175.3848 3195.9023
redmass: 3.3569 4.8901 2.6537 2.8456 3.1357 4.9335 3.7298 3.3498 4.9370 2.1341 3.8972 5.2342 1.6824 3.1127 1.5942 3.6321 2.4372 1.7360 3.3502 4.9350 4.9844 6.9305 4.8834 3.8470 9.6839 5.4225 8.4051 3.8418 6.2659 8.9466 10.0678 6.2895 7.3138 7.0963 8.2459 1.1317 1.1004 8.6923 1.5577 4.7009 3.7611 9.6267 1.3170 3.8214 2.4975 2.7995 1.5769 2.1640 2.2080 1.2538 1.4223 1.3408 1.5348 4.3875 2.4699 1.1441 1.1248 5.0278 5.4740 1.2831 1.2743 2.6075 1.2318 1.2451 1.3299 1.0509 1.0397 1.0414 1.0524 1.0686 1.0530 1.0593 1.0795 5.5861 6.6348 1.0365 1.0546 1.0382 1.0291 1.0596 1.1077 1.0968 1.1047 1.0981 1.1045 1.1022 1.1052 1.1053 1.0898 1.1003
irintensity: 0.4502 0.6917 0.8605 0.6734 5.0229 0.0599 0.0380 1.4538 7.8450 4.7540 6.9572 3.1796 1.0787 2.6995 3.1222 34.4378 4.1698 1.7159 7.6116 8.6374 9.4692 18.9318 22.4090 3.5603 1.1282 25.0222 25.3282 9.9104 18.7902 101.5879 88.7258 49.5233 119.7651 1.3512 98.1591 5.2965 2.5645 100.8356 51.7720 227.6752 118.4400 73.0568 0.0173 4.9562 166.4220 82.9146 6.9285 5.8217 6.0499 0.1207 4.8510 4.5808 8.7763 3.5998 240.6611 0.3907 6.4669 36.9076 9.8318 8.4594 30.7991 439.4437 28.8429 25.6872 67.4778 14.6442 12.2171 11.4796 33.1960 3.1012 5.5844 11.3229 11.5513 56.0020 14.6299 24.1320 21.5737 27.6688 41.6128 13.7882 13.2636 24.0052 4.8889 25.6853 25.2260 30.8238 23.6372 25.3312 0.9697 1.8639
temp: 298.150 k
press: 1.00000 atm
elementType: 16 15 8 8 8 8 7 7 6 6 6 6 6 6 6 6 6 1 1 1 1 1 1 1 1 1 1 1 1 1 1 1
symmnumber: 1
zpe: 632068.6 jmol-1
zpe.correction: 0.240742 hartree
zpe.thermalcorrener: 0.260977 hartree
zpe.thermalcorrenthalpy: 0.261921 hartree
zpe.thermalcorrgfe: 0.189344 hartree
zpe.sumelectzpe: -1500.267297 hartree
zpe.sumelectthermal: -1500.247062 hartree
zpe.sumelectthermalent: -1500.246118 hartree
zpe.sumelectthermalfe: -1500.318695 hartree
dipole: -2.0755 -1.6561 -0.6208
dipole: 2.7269
quadrupole: -99.2983 -98.8374 -123.0391
quadrupole: -6.5432 1.8242 -2.4204
quadrupole: 7.7599 8.2209 -15.9808 -6.5432 1.8242 -2.4204
hfenergy: -1500.5080388 hartree
pointgroup: C01 [X(C9H15N2O4P1S1)]
dipole: -0.8678006 0.5923786 0.2167384 debye
polarizability: 229.0285189|10.3478889|169.6944515|4.4184624|8.9999989|128.9313179 unknown
InChI: InChI=1S/C9H15N2O4PS/c1-4-13-16(17,14-5-2)15-9-7-6-8(12-3)10-11-9/h6-7H,4-5H2,1-3H3
charge 0 multiplicity 1
32 atoms
S  2.016075 -0.603505 -1.980251
P  1.920494 -0.149774 0.027979
O  1.7648 -1.363512 1.219373
O  3.263256 0.636831 0.747818
O  0.737758 1.156867 0.458244
O  -4.562042 0.106482 -0.3381
N  -0.994103 -0.352181 0.00586
N  -2.324489 -0.6390 -0.196211
C  1.104507 -2.668873 0.871029
C  3.84724 1.820016 0.043887
C  -0.610818 0.925251 0.254348
C  2.14584 -3.690539 0.416803
C  5.134685 2.152593 0.790657
C  -1.518782 2.020932 0.330371
C  -2.868878 1.737756 0.13124
C  -3.224511 0.380154 -0.134964
C  -4.917867 -1.302459 -0.625225
H  0.62823 -2.954718 1.823485
H  0.319062 -2.481733 0.118131
H  4.035814 1.55161 -1.013639
H  3.11649 2.64873 0.087189
H  1.65744 -4.674058 0.278841
H  2.600907 -3.393166 -0.54332
H  2.942637 -3.802233 1.172112
H  5.617547 3.033015 0.327526
H  4.922904 2.384401 1.847967
H  5.837852 1.303858 0.751884
H  -1.15146 3.02844 0.536211
H  -3.643681 2.506834 0.16837
H  -4.403404 -1.651751 -1.536204
H  -6.008331 -1.282481 -0.763031
H  -4.631576 -1.952084 0.219021
