program: Gaussian 09
title: 000198113
version: EM64L-G09RevD.01
frameworkgroup: C1[X(C11H19N2O4PS)]
method: RPBEPBE
basis: SDD
operation: Freq
keyword: #p
keyword: freq=noraman
keyword: PBEPBE/SDD
title: #p freq=noraman PBEPBE/SDD
converged: YES YES NO NO
title: Mulliken charges:
elementType: S P O O O O N N C C C C C C C C C C C H H H H H H H H H H H H H H H H H H H
charge: -0.225597 0.897603 -0.286513 -0.462137 -0.473510 -0.467247 -0.141756 -0.150652 0.049679 -0.692031 -0.693575 0.214642 -0.238510 -0.212723 0.272158 -0.273925 -0.250993 -0.649471 -0.654054 0.237736 0.233199 0.209232 0.222819 0.213578 0.259391 0.218107 0.263743 0.228601 0.228379 0.224965 0.269199 0.269188 0.210280 0.241916 0.229881 0.207759 0.235605 0.235037
chargesum: 0.00000
title: Mulliken charges with hydrogens summed into heavy atoms:
elementType: S P O O O O N N C C C C C C C C C C C
charge: -0.225597 0.897603 -0.286513 -0.462137 -0.473510 -0.467247 -0.141756 -0.150652 0.287416 -0.026782 -0.002500 0.214642 0.253834 0.240621 0.272158 -0.004727 0.018195 0.032606 0.024346
polarizability: 2.66855600e+02 -8.18686238e+00 1.87223165e+02 9.76303288e-01 6.43588609e+00 1.48843730e+02
1716.lowfreq: -5.8237 -0.0026 -0.0024 -0.0004 2.6849 9.3335 23.8304 30.1242 37.0588
frequency: 23.7923 29.7891 36.6898 44.6766 50.0288 58.8606 61.5050 76.9626 82.5753 104.2078 132.0594 139.0037 147.4017 177.3873 185.9059 204.2683 220.6249 228.1111 229.6468 242.6214 294.5681 299.5863 313.3903 335.7518 359.2372 372.4938 402.9839 412.2012 424.5570 437.9637 465.2907 516.9179 530.9236 571.5388 603.8987 652.0152 685.3718 715.5845 736.2630 744.8716 792.4067 810.9497 814.0598 834.8726 847.4068 865.6585 891.9642 908.0370 923.7416 940.5613 964.1116 981.7156 1003.5163 1023.5344 1088.6638 1095.1847 1103.0376 1106.6197 1134.4094 1148.5575 1155.0431 1175.0246 1181.3334 1232.2257 1254.4238 1259.3559 1265.8549 1300.3520 1331.9117 1335.3126 1344.6906 1356.9669 1373.7952 1378.3316 1392.1067 1395.8258 1396.4196 1454.8535 1457.1914 1460.3929 1464.3578 1470.5166 1472.4028 1478.4684 1485.2293 1486.7385 1488.2251 1514.8450 1576.1240 2987.4621 2988.0646 2989.2205 2993.3561 2997.0971 3027.3130 3031.0326 3055.9652 3083.6346 3083.7654 3087.9901 3093.5635 3094.5394 3099.3906 3106.0261 3112.4376 3113.6611 3173.5153 3194.4016
redmass: 4.4007 3.3876 3.7410 3.0854 2.0839 2.7614 4.9189 4.0523 4.5235 3.3972 5.7289 4.1787 6.3504 4.0232 1.0546 4.1251 4.5701 1.1979 1.2393 1.3512 3.8345 2.9358 4.8600 4.0554 4.7079 4.3957 4.0273 3.6664 6.1576 3.7984 3.9162 7.8282 3.7255 8.0341 8.0247 10.1951 6.1893 7.2432 7.0719 4.9783 1.1429 1.2563 4.2824 1.5582 4.5883 4.6455 3.7147 3.1885 1.2197 1.3591 1.3168 3.9829 2.4997 2.8083 1.6277 2.1994 1.5447 2.1930 1.4246 1.5421 2.0015 4.4789 1.9678 2.4144 1.1447 1.1255 5.0577 1.9186 1.4524 2.1604 1.3835 1.2570 2.4394 1.4627 1.2327 1.2402 1.2444 1.0535 1.0397 1.0419 1.0473 1.0681 1.0508 1.0557 1.0585 1.0469 1.0781 5.6233 6.8138 1.0365 1.0554 1.0357 1.0359 1.0379 1.0592 1.0866 1.1073 1.0973 1.0989 1.1044 1.0980 1.0987 1.1004 1.1006 1.1022 1.1055 1.0897 1.1002
irintensity: 0.4851 0.5719 0.7243 1.1840 2.0695 1.2040 0.8154 0.7262 3.5873 5.7443 2.1499 3.9850 3.6039 16.9221 0.8572 7.1692 2.7446 0.1903 3.8112 0.2792 14.8639 1.9844 8.3390 7.7361 4.4749 14.6039 16.2304 4.4538 2.2534 24.2066 16.1026 27.7966 6.0261 50.6931 78.5702 103.4369 48.7384 123.0867 1.5589 14.4768 5.2280 26.0870 183.5061 49.9349 22.1149 227.2161 126.0228 57.9192 4.4232 1.6538 0.0207 6.6180 160.1820 92.1560 25.3544 2.1207 98.2234 3.5055 4.9629 8.8530 11.0268 16.2082 35.1433 279.0682 0.4193 8.6470 59.5219 46.6653 19.0353 82.0592 20.8084 12.5974 352.7012 115.0041 27.6910 29.6413 23.7480 5.5004 12.1215 11.3276 3.0510 5.8592 0.9485 5.1121 11.1723 18.6869 11.7293 60.8105 15.5105 25.2328 21.0547 15.0416 29.7069 27.0793 13.0746 4.2126 13.3254 15.0786 15.8076 4.7187 25.9459 45.5939 24.3872 28.8271 30.3946 24.1885 1.2579 2.0834
temp: 298.150 k
press: 1.00000 atm
elementType: 16 15 8 8 8 8 7 7 6 6 6 6 6 6 6 6 6 6 6 1 1 1 1 1 1 1 1 1 1 1 1 1 1 1 1 1 1 1
symmnumber: 1
zpe: 776862.6 jmol-1
zpe.correction: 0.295891 hartree
zpe.thermalcorrener: 0.318940 hartree
zpe.thermalcorrenthalpy: 0.319884 hartree
zpe.thermalcorrgfe: 0.240753 hartree
zpe.sumelectzpe: -1578.726044 hartree
zpe.sumelectthermal: -1578.702995 hartree
zpe.sumelectthermalent: -1578.702051 hartree
zpe.sumelectthermalfe: -1578.781183 hartree
dipole: -2.4090 -1.6162 -0.7202
dipole: 2.9890
quadrupole: -110.6790 -112.2777 -135.9865
quadrupole: -8.0457 1.0620 -1.1627
quadrupole: 8.9687 7.3700 -16.3388 -8.0457 1.0620 -1.1627
hfenergy: -1579.0219354 hartree
pointgroup: C01 [X(C11H19N2O4P1S1)]
dipole: -0.9807089 -0.5913797 -0.2672058 debye
polarizability: 266.0617988|-10.7897768|187.4510798|-3.468743|8.085583|149.4096164 unknown
InChI: InChI=1S/C11H19N2O4PS/c1-5-14-18(19,15-6-2)17-11-8-7-10(12-13-11)16-9(3)4/h7-9H,5-6H2,1-4H3
charge 0 multiplicity 1
38 atoms
S  2.517137 0.57258 2.038827
P  2.502658 0.192421 0.013093
O  -3.931663 -0.677787 0.158735
O  2.241998 1.434976 -1.12948
O  3.933585 -0.417187 -0.707918
O  1.468606 -1.205992 -0.496138
N  -1.763628 0.283014 0.113674
N  -0.407622 0.119482 -0.046024
C  -4.48269 0.690526 0.495077
C  -5.828197 0.408111 1.165271
C  -4.586889 1.523627 -0.789488
C  -2.571307 -0.808937 -0.017498
C  1.467791 2.658996 -0.727779
C  4.619483 -1.574476 -0.055041
C  0.097411 -1.106334 -0.330419
C  -2.080865 -2.1167 -0.32204
C  -0.705177 -2.272838 -0.482877
C  2.420873 3.761003 -0.26764
C  5.987215 -1.678064 -0.722006
H  -3.768621 1.162004 1.195051
H  -5.696543 -0.216883 2.064824
H  -6.302937 1.359429 1.465942
H  -6.507659 -0.116622 0.470708
H  -5.026321 2.511369 -0.558355
H  -3.590456 1.687079 -1.231488
H  -5.235943 1.019377 -1.527348
H  0.723964 2.377612 0.038077
H  0.940016 2.925358 -1.658531
H  4.006898 -2.479709 -0.221215
H  4.700642 -1.379766 1.032189
H  -2.78156 -2.94965 -0.414725
H  -0.243347 -3.235118 -0.713583
H  1.847567 4.690516 -0.088238
H  2.927514 3.480645 0.671624
H  3.183507 3.967113 -1.038152
H  6.544822 -2.533872 -0.298336
H  5.879558 -1.833324 -1.808703
H  6.572382 -0.758276 -0.555468
