program: Gaussian 09
title: 000198115
version: EM64L-G09RevD.01
frameworkgroup: C1[X(C13H23N2O4PS)]
method: RPBEPBE
basis: SDD
operation: Freq
keyword: #p
keyword: freq=noraman
keyword: PBEPBE/SDD
title: #p freq=noraman PBEPBE/SDD
converged: YES YES NO NO
title: Mulliken charges:
elementType: S P O O O O N N C C C C C C C C C C C C C H H H H H H H H H H H H H H H H H H H H H H H
charge: -0.226042 0.898102 -0.269569 -0.466448 -0.462239 -0.473794 -0.127155 -0.148747 -0.344033 -0.390076 -0.352148 -0.277486 -0.692104 0.203354 -0.271488 0.272167 -0.252301 -0.242353 -0.212440 -0.649324 -0.654742 0.190918 0.189359 0.208916 0.210239 0.197711 0.196574 0.224788 0.230394 0.210978 0.210339 0.218350 0.269332 0.269327 0.267419 0.228564 0.227661 0.225949 0.210750 0.229225 0.243423 0.207759 0.235237 0.235654
chargesum: 0.00000
title: Mulliken charges with hydrogens summed into heavy atoms:
elementType: S P O O O O N N C C C C C C C C C C C C C
charge: -0.226042 0.898102 -0.269569 -0.466448 -0.462239 -0.473794 -0.127155 -0.148747 0.036243 0.029079 0.042138 0.177696 -0.052437 0.203354 -0.002157 0.272167 0.017026 0.253630 0.241170 0.034073 0.023908
polarizability: 3.03486931e+02 -3.52366842e+00 2.07526097e+02 2.56393406e+00 5.43691217e+00 1.62324210e+02
1716.lowfreq: -6.6443 0.0012 0.0014 0.0016 4.2489 6.6239 17.9893 27.2515 37.2773
frequency: 17.8329 27.1875 37.1546 38.2709 41.9940 53.5355 57.6594 63.3487 73.3262 87.6574 90.7156 105.2805 121.1861 132.6505 142.8077 151.9875 162.8128 181.5430 191.9380 217.8617 226.1254 230.8958 239.1638 263.3102 296.4854 312.0100 316.7561 354.4354 371.7064 406.5589 414.6237 428.5001 438.5864 482.3013 521.4291 528.9071 571.4609 605.7529 653.3459 684.4614 716.2018 730.1963 736.5900 765.3825 788.0171 794.2752 813.4355 820.5221 834.0474 844.0868 864.2039 890.3423 893.1818 939.6564 963.5062 966.6099 982.0456 1003.8833 1020.2656 1025.0866 1068.8649 1076.3280 1093.0727 1094.8137 1106.6629 1127.2929 1135.4634 1147.6225 1147.9405 1174.7929 1201.8991 1232.2213 1253.7452 1255.4453 1257.0876 1260.7965 1266.1152 1282.3141 1292.4160 1306.9143 1326.1275 1345.2183 1353.8998 1358.2953 1360.8843 1388.9489 1390.2943 1393.1022 1395.6901 1456.9516 1458.8783 1466.5257 1467.2217 1473.8529 1474.2269 1478.6567 1478.7250 1483.1335 1485.2586 1488.8418 1490.0070 1516.6129 1576.1921 2959.0411 2971.1150 2974.4188 2988.1495 2988.9906 2991.0064 2997.2210 2999.6170 3001.2778 3025.6601 3025.7759 3046.0956 3055.8318 3070.5577 3074.4348 3076.5434 3084.2212 3087.8737 3093.5445 3112.6025 3113.8642 3173.7437 3194.6657
redmass: 4.4770 4.0367 4.3770 3.4228 2.3185 2.7359 2.7147 2.0004 4.9183 3.9627 3.5686 2.9750 1.8190 4.6783 4.5443 4.9409 3.5480 4.5337 5.4068 4.8179 1.2391 1.1166 1.4846 3.7524 3.4600 4.8378 3.7561 4.8142 5.9490 4.5117 3.9917 9.5222 3.5185 5.8287 6.9461 3.6703 8.5635 8.9369 10.1589 6.3278 7.2965 1.0711 7.0443 1.1106 9.5881 1.1330 1.1027 8.3553 1.5564 1.1783 4.6035 2.1586 3.5914 5.3816 1.3177 1.1619 3.9551 2.5246 3.6747 2.8545 2.3885 2.4997 1.8177 1.7840 2.2122 2.4992 1.4288 1.4585 1.5406 4.5246 1.4319 2.4317 1.3071 1.2253 1.1395 1.1385 4.9630 1.1061 1.0816 1.8638 2.1902 1.3089 1.7588 1.2753 1.8550 1.8318 1.3281 1.2879 1.2462 1.0397 1.0410 1.0847 1.0689 1.0674 1.0723 1.0423 1.0533 1.0767 1.0615 1.0800 1.0960 5.4758 6.7301 1.0588 1.0594 1.0365 1.0364 1.0545 1.0599 1.0383 1.0991 1.0566 1.0606 1.1017 1.1043 1.1078 1.1019 1.0992 1.1068 1.0967 1.1049 1.0980 1.1022 1.1051 1.0898 1.1001
irintensity: 0.1344 0.2295 0.8663 0.7511 0.1285 1.9229 0.9053 3.7787 0.2134 0.1091 1.0989 3.2098 2.7388 2.7918 4.5639 0.5808 3.7992 11.8780 6.9370 7.2400 2.4654 0.0123 1.7631 2.8098 11.9850 7.1745 15.3990 2.4422 10.7690 28.4976 4.8978 0.3145 23.9590 10.0352 35.5918 5.6761 57.1204 74.9623 90.6908 48.9796 123.1619 11.3866 1.4455 0.2075 109.4665 5.9853 2.3639 100.2334 49.6605 2.0411 215.0102 61.5126 101.4447 97.2561 0.0343 0.9845 6.1223 164.6318 12.8740 88.4608 32.5850 4.3686 7.4870 3.2381 6.3438 3.4358 4.8492 0.1558 8.2871 6.3233 0.5455 300.7528 9.4383 0.0699 0.5692 11.0734 59.4199 0.3250 0.5960 31.8993 12.3164 44.5472 226.9417 14.7327 184.5477 144.7255 44.5728 13.1401 22.1656 12.2745 11.1614 0.2191 0.3372 5.6463 2.6326 12.9431 5.4015 0.1396 12.5582 10.9197 27.1112 55.9216 16.6875 5.1770 49.8637 36.3138 25.4507 20.8476 20.9882 28.3754 0.8247 37.9294 10.4960 18.7259 9.2114 13.3181 30.1924 53.4740 114.7543 25.9319 3.1325 25.9301 30.6420 23.4449 1.1964 2.0004
temp: 298.150 k
press: 1.00000 atm
elementType: 16 15 8 8 8 8 7 7 6 6 6 6 6 6 6 6 6 6 6 6 6 1 1 1 1 1 1 1 1 1 1 1 1 1 1 1 1 1 1 1 1 1 1 1
symmnumber: 1
zpe: 925495.2 jmol-1
zpe.correction: 0.352502 hartree
zpe.thermalcorrener: 0.378278 hartree
zpe.thermalcorrenthalpy: 0.379223 hartree
zpe.thermalcorrgfe: 0.292758 hartree
zpe.sumelectzpe: -1657.165802 hartree
zpe.sumelectthermal: -1657.140026 hartree
zpe.sumelectthermalent: -1657.139082 hartree
zpe.sumelectthermalfe: -1657.225546 hartree
dipole: -2.3221 -2.0757 -0.6279
dipole: 3.1772
quadrupole: -123.6549 -127.6564 -148.2336
quadrupole: -8.7868 2.4093 -2.5969
quadrupole: 9.5267 5.5252 -15.0520 -8.7868 2.4093 -2.5969
hfenergy: -1657.5183042 hartree
pointgroup: C01 [X(C13H23N2O4P1S1)]
dipole: 0.9438281 0.780429 -0.2502909 debye
polarizability: 303.2099007|-6.5388866|207.549013|-0.0847226|-6.6170525|162.5783242 unknown
InChI: InChI=1S/C13H23N2O4PS/c1-4-7-8-11-16-12-9-10-13(15-14-12)19-20(21,17-5-2)18-6-3/h9-10H,4-8,11H2,1-3H3
charge 0 multiplicity 1
44 atoms
S  -3.256697 -0.84984 2.011041
P  -3.424366 -0.351367 0.017596
O  2.834895 1.390602 -0.067521
O  -2.61199 1.205471 -0.436071
O  -3.089707 -1.47715 -1.222868
O  -4.962292 0.112725 -0.581615
N  0.823632 0.149207 -0.094792
N  -0.548441 0.128284 -0.186649
C  5.885563 -0.895716 0.198802
C  5.037237 0.396187 0.132864
C  7.402825 -0.611587 0.283132
C  3.543677 0.081176 0.064781
C  8.250412 -1.90121 0.324437
C  1.459291 1.35383 -0.152826
C  0.777968 2.600371 -0.302513
C  -1.234704 1.289248 -0.329861
C  -0.61274 2.569266 -0.393068
C  -2.110008 -2.590325 -0.974109
C  -5.755011 1.109397 0.201093
C  -2.833624 -3.833656 -0.4596
C  -7.141141 1.127858 -0.434854
H  5.579687 -1.501054 1.077443
H  5.681985 -1.519771 -0.696171
H  5.323781 0.988589 -0.757537
H  5.239689 1.026935 1.019747
H  7.609655 -0.000747 1.185135
H  7.706461 0.004936 -0.587206
H  3.285611 -0.546786 -0.808544
H  3.1748 -0.429622 0.973396
H  7.987353 -2.521675 1.201839
H  8.083795 -2.513928 -0.581494
H  9.330264 -1.673026 0.384025
H  1.348721 3.531048 -0.340532
H  -1.21694 3.471599 -0.507541
H  -1.324179 -2.226921 -0.289141
H  -1.670704 -2.746346 -1.973377
H  -5.252541 2.0917 0.127969
H  -5.786937 0.79062 1.261035
H  -2.115159 -4.672341 -0.388019
H  -3.644754 -4.129753 -1.146818
H  -3.25953 -3.656258 0.542578
H  -7.781407 1.862441 0.087854
H  -7.615185 0.13454 -0.365482
H  -7.077545 1.412446 -1.498556
