program: Gaussian 09
title: 000198092
version: EM64L-G09RevD.01
frameworkgroup: C1[X(C18H23N5O)]
method: RPBEPBE
basis: SDD
operation: Freq
keyword: #p
keyword: freq=noraman
keyword: PBEPBE/SDD
title: #p freq=noraman PBEPBE/SDD
converged: YES YES NO NO
title: Mulliken charges:
elementType: O N N N N N C C C C C C C C C C C C C C C C C C H H H H H H H H H H H H H H H H H H H H H H H
charge: -0.299795 -0.085500 -0.148195 -0.388529 -0.109473 -0.688445 -0.355370 -0.367823 -0.377483 -0.386116 -0.321327 -0.404734 0.246881 -0.321382 0.157369 -0.181953 -0.347951 -0.221772 0.285373 -0.347809 -0.325171 -0.414575 -0.432528 0.504273 0.226988 0.194011 0.189629 0.206684 0.200581 0.218757 0.206526 0.270124 0.225483 0.195331 0.227422 0.249893 0.295163 0.216205 0.227845 0.229582 0.225978 0.272110 0.197448 0.220245 0.217642 0.310109 0.308280
chargesum: 0.00000
title: Mulliken charges with hydrogens summed into heavy atoms:
elementType: O N N N N N C C C C C C C C C C C C C C C C C C
charge: -0.299795 -0.085500 -0.148195 -0.093366 -0.109473 -0.070056 0.065629 0.028490 0.041854 0.090534 0.099487 0.072581 0.246881 -0.105177 0.157369 0.045891 -0.118368 0.004207 0.285373 -0.075699 -0.127723 -0.194330 -0.214886 0.504273
polarizability: 3.91270569e+02 1.08144454e+01 2.18852500e+02 2.94852231e+00 8.49361062e+00 1.38565711e+02
1716.lowfreq: -13.3735 -4.0019 -3.4109 -0.0006 0.0004 0.0006 6.7678 13.6413 20.6963
frequency: 6.5524 13.6389 20.4080 28.3521 40.0942 59.1185 62.0534 76.6928 103.3803 141.4729 161.4600 166.2641 211.4795 244.6378 252.0768 282.2388 291.0890 310.3738 322.3839 360.9436 368.9218 387.2305 398.7422 403.0077 406.8770 409.8345 412.8307 468.0692 472.0818 483.3679 490.9530 509.4733 520.1093 556.8288 604.6444 615.3559 627.3813 635.1710 683.8690 726.6074 728.1097 733.9379 755.5719 767.4757 777.8353 808.6793 813.1726 838.0267 842.0097 844.4807 845.8876 925.3551 932.5482 940.7915 942.0303 953.3593 976.0652 986.6229 990.0912 999.5622 1011.6529 1020.4626 1041.7502 1045.4926 1050.9750 1056.9341 1077.8696 1090.3069 1101.6084 1131.0918 1141.3523 1144.1124 1154.9314 1170.1811 1186.7113 1194.0930 1201.5926 1235.2922 1248.3034 1272.1925 1278.5413 1296.6637 1300.9354 1305.2627 1309.9288 1320.5370 1325.3286 1329.5430 1338.1358 1352.9181 1362.5040 1373.5158 1384.2292 1389.1425 1391.3236 1424.8473 1435.7884 1443.2135 1454.8719 1456.8531 1461.8465 1468.0657 1478.0162 1479.9726 1486.3419 1524.4405 1550.6480 1556.9392 1594.9072 1598.1826 1631.9146 1645.6887 2860.5665 2868.1184 2904.4604 2947.4829 2950.6842 3019.8231 3022.0238 3034.5780 3052.2074 3088.3709 3088.9281 3095.2950 3108.6552 3116.4009 3123.5266 3133.7323 3135.2648 3160.4236 3165.5192 3176.2961 3563.6476 3576.5804 3703.6104
redmass: 5.3501 4.9466 3.6741 5.3793 4.8896 3.4778 3.9638 5.1260 5.4006 4.6114 3.4482 2.9509 4.3431 3.3966 2.0532 4.1179 2.5551 5.8948 3.1834 2.8577 3.4502 1.1968 1.5388 1.5521 2.3649 3.4037 3.5464 3.7270 2.6813 2.8393 1.9535 2.7897 1.9806 5.5741 4.2973 5.3184 2.6134 6.7457 3.7501 1.7201 4.0128 1.7261 4.3345 2.4734 3.5070 1.5349 2.5454 2.0981 1.8305 1.7636 1.5039 3.8655 1.4066 2.2910 1.5336 3.9745 1.3194 1.3559 3.9934 2.7124 2.5712 1.5655 2.4175 2.2283 2.4269 2.1429 2.0429 1.7897 2.2217 1.2476 2.4484 2.3977 3.0705 1.1341 1.8648 1.1746 1.1443 1.5745 1.4475 1.6825 1.6683 1.3483 2.0214 1.1919 1.4508 1.3858 2.4889 1.6274 1.9063 1.4393 1.3540 1.3396 4.4677 1.5086 1.8950 2.1562 1.6546 1.9208 1.0883 1.1237 1.1261 1.1546 1.1010 1.8699 2.6826 3.0191 5.2188 6.4637 6.5275 6.0353 3.0348 1.4646 1.0712 1.0695 1.0680 1.0691 1.0694 1.0820 1.0689 1.0898 1.0897 1.0911 1.1049 1.0920 1.0863 1.0893 1.0894 1.0886 1.0960 1.0950 1.0925 1.0998 1.0450 1.0775 1.1040
irintensity: 0.9087 0.8319 1.1606 0.4047 9.2871 2.1731 0.3008 1.2957 0.7224 0.8968 2.4700 2.0537 2.7781 16.0046 3.2645 7.8802 2.9652 3.0083 15.5227 8.2125 12.7390 201.7755 13.1789 83.0996 3.8068 4.1484 6.3306 6.4210 1.0236 18.7124 49.6732 8.6660 53.7538 13.9922 9.2339 0.3914 2.7654 1.5986 23.3551 31.7076 1.7513 3.7441 20.0277 62.5458 1.3012 17.0702 2.0790 4.2246 11.2807 40.7015 4.7069 10.7216 0.2168 2.8708 0.5750 66.2315 0.1809 1.2440 2.1391 62.0273 7.7033 5.0271 8.5038 1.0755 9.0101 12.7985 2.8167 0.2821 5.7005 23.7138 73.4800 35.6332 31.5257 6.7525 0.5985 110.3022 1.9291 6.5175 163.4277 141.7325 117.0596 24.8240 11.9831 41.5870 45.0160 10.7094 48.8344 5.3268 57.0880 4.8418 7.8803 24.9307 0.4325 2.8814 0.2813 33.9456 35.0263 3.8634 17.3799 73.3534 110.3212 15.6912 10.2287 405.0082 175.0132 25.0588 44.6686 66.4621 121.5498 392.9837 83.5867 358.5190 40.7783 85.0287 83.3075 26.2527 117.4790 20.4990 38.2489 59.9290 35.5066 17.9500 20.9756 10.2396 23.5142 33.7728 23.7156 12.6246 23.1861 6.3414 36.1646 14.5425 108.1153 9.7766 22.4623
temp: 298.150 k
press: 1.00000 atm
elementType: 8 7 7 7 7 7 6 6 6 6 6 6 6 6 6 6 6 6 6 6 6 6 6 6 1 1 1 1 1 1 1 1 1 1 1 1 1 1 1 1 1 1 1 1 1 1 1
symmnumber: 1
zpe: 1022578.8 jmol-1
zpe.correction: 0.389480 hartree
zpe.thermalcorrener: 0.411904 hartree
zpe.thermalcorrenthalpy: 0.412849 hartree
zpe.thermalcorrgfe: 0.332926 hartree
zpe.sumelectzpe: -1046.932341 hartree
zpe.sumelectthermal: -1046.909916 hartree
zpe.sumelectthermalent: -1046.908972 hartree
zpe.sumelectthermalfe: -1046.988895 hartree
dipole: -6.1868 -1.8205 -0.2614
dipole: 6.4544
quadrupole: -89.2110 -131.2965 -147.1313
quadrupole: 14.7717 10.8484 0.7100
quadrupole: 33.3353 -8.7502 -24.5851 14.7717 10.8484 0.7100
hfenergy: -1047.3218205 hartree
pointgroup: C01 [X(C18H23N5O1)]
dipole: -2.4282929 0.7421362 0.0309686 debye
polarizability: 391.0931822|-12.4448169|219.8711876|-0.3206224|2.2275729|137.7244106 unknown
InChI: InChI=1S/C18H23N5O/c19-16-6-4-15(5-7-16)18(24)21-9-10-22-11-13-23(14-12-22)17-3-1-2-8-20-17/h1-8,21H,9-14,19H2
charge 0 multiplicity 1
47 atoms
O  -2.541672 -1.372012 -0.418288
N  1.184954 0.950301 -0.458694
N  3.950266 0.166883 -0.252358
N  -2.579457 0.88094 -0.964553
N  6.040958 0.74677 0.663616
N  -8.773312 -0.193959 0.913202
C  1.559937 -0.480621 -0.346062
C  2.148753 1.783569 0.303419
C  2.974751 -0.718892 -0.91111
C  3.568591 1.595548 -0.257327
C  -0.234486 1.196176 -0.114754
C  -1.154309 0.885953 -1.324601
C  5.237143 -0.228275 0.112814
C  5.720778 -1.5698 -0.054406
C  -3.194374 -0.277506 -0.501866
C  7.020651 -1.88363 0.377482
C  7.294612 0.412195 1.068802
C  7.840811 -0.884259 0.959502
C  -4.644357 -0.186787 -0.133602
C  -5.350207 -1.404283 0.061279
C  -5.354758 1.030468 0.050606
C  -6.710049 -1.416111 0.402947
C  -6.716845 1.03615 0.398178
C  -7.422855 -0.191103 0.574559
H  0.836805 -1.098224 -0.906908
H  1.534053 -0.8188 0.7209
H  2.148916 1.526403 1.392883
H  1.860267 2.846201 0.201038
H  3.241033 -1.774522 -0.746635
H  2.962302 -0.528522 -2.006247
H  3.592126 1.980295 -1.299738
H  4.314449 2.141957 0.339436
H  -0.572947 0.582482 0.753347
H  -0.347906 2.259619 0.170239
H  -0.976538 1.624043 -2.126127
H  -0.911549 -0.115838 -1.717708
H  -3.125055 1.732014 -1.092168
H  5.108073 -2.346235 -0.518554
H  7.396447 -2.905569 0.252715
H  7.881942 1.233088 1.498965
H  8.856804 -1.097462 1.302691
H  -4.792689 -2.338637 -0.062619
H  -4.849298 2.000128 -0.042808
H  -7.232636 -2.370543 0.541428
H  -7.240692 1.988673 0.54442
H  -9.273733 -1.067834 1.047059
H  -9.283497 0.675667 1.037006
