program: Gaussian 09
title: 000198032
version: EM64L-G09RevD.01
frameworkgroup: C1[X(C8H4ClF3N2O)]
method: RPBEPBE
basis: SDD
operation: Freq
keyword: #p
keyword: freq=noraman
keyword: PBEPBE/SDD
title: #p freq=noraman PBEPBE/SDD
converged: NO NO NO NO
title: Mulliken charges:
elementType: Cl F F F O N N C C C C C C C C H H H H
charge: 0.003203 -0.117815 -0.159889 -0.160305 -0.408415 -0.428881 -0.020698 0.337089 0.043274 0.113498 -0.339912 -0.497579 0.428916 0.258424 -0.284489 0.338939 0.270059 0.256452 0.368131
chargesum: 0.00000
title: Mulliken charges with hydrogens summed into heavy atoms:
elementType: Cl F F F O N N C C C C C C C C
charge: 0.003203 -0.117815 -0.159889 -0.160305 -0.040285 -0.089942 -0.020698 0.337089 0.043274 0.113498 -0.069853 -0.241127 0.428916 0.258424 -0.284489
polarizability: 1.94594421e+02 1.48809717e-01 1.13016830e+02 -6.24262387e-03 -1.36582717e-04 5.08988067e+01
1716.lowfreq: -25.2320 -2.5836 -0.0020 -0.0020 0.0011 7.2836 7.5755 58.8277 111.9370
frequency: -24.8450 58.8157 111.9366 117.7773 165.1191 215.2742 257.9786 280.4907 283.7289 337.7392 352.0655 355.0955 390.2196 409.2908 425.4516 476.0592 495.3966 518.2676 583.1440 607.6163 650.6551 677.8429 681.8447 698.2048 745.5609 759.0224 844.7561 847.0724 856.7086 919.4562 962.4021 987.7538 1037.7764 1096.9542 1114.0742 1160.5144 1217.1940 1229.8177 1279.8304 1313.3581 1373.2323 1414.3094 1452.4632 1463.0473 1522.4242 1595.3138 1641.1284 3150.2454 3170.9800 3586.9433 3588.7177
redmass: 10.8317 12.8345 13.7124 9.3543 9.0841 13.1432 15.6578 8.7381 6.2156 4.8335 1.2777 10.3504 8.9644 11.2570 2.9494 7.4473 11.2015 10.8375 6.0745 1.1901 14.8562 7.6682 7.4327 9.9087 3.1657 8.0147 4.1094 1.7625 1.4402 9.8574 12.0955 5.1416 7.9041 5.3944 1.6110 2.3986 2.4310 1.6259 1.7556 6.4819 6.5587 6.0014 3.2629 6.0364 5.9771 7.7995 8.0888 1.0929 1.0938 1.0814 1.0669
irintensity: 0.5317 0.8504 1.4332 2.1922 3.2030 0.1319 2.6584 16.7302 11.1615 0.0128 128.3531 4.2732 9.2097 1.4086 25.0199 18.6550 0.3381 12.6691 15.8891 82.3748 0.7518 0.0210 13.0689 0.3258 1.1840 10.4001 1.7624 9.9721 55.6153 60.7828 284.4766 44.6289 228.5208 156.4114 327.6099 13.0517 180.9825 122.9812 113.9818 18.5253 68.3176 30.1365 22.3591 38.1652 91.4793 66.9709 8.2213 4.2650 0.1419 113.1902 29.5385
temp: 298.150 k
press: 1.00000 atm
elementType: 17 9 9 9 8 7 7 6 6 6 6 6 6 6 6 1 1 1 1
symmnumber: 1
zpe: 295962.5 jmol-1
zpe.correction: 0.112726 hartree
zpe.thermalcorrener: 0.124500 hartree
zpe.thermalcorrenthalpy: 0.125444 hartree
zpe.thermalcorrgfe: 0.074343 hartree
zpe.sumelectzpe: -1250.493202 hartree
zpe.sumelectthermal: -1250.481428 hartree
zpe.sumelectthermalent: -1250.480484 hartree
zpe.sumelectthermalfe: -1250.531585 hartree
dipole: -1.6093 -1.0240 -0.0074
dipole: 1.9075
quadrupole: -112.3308 -76.5978 -94.1976
quadrupole: -11.5099 -0.0230 0.0070
quadrupole: -17.9554 17.7776 0.1778 -11.5099 -0.0230 0.0070
hfenergy: -1250.605928 hartree
pointgroup: C01 [X(C8H4Cl1F3N2O1)]
dipole: -0.6141758 0.4312588 0.0034018 debye
dipolederiv: -0.6679319 0.223505 0.0000418 0.3825993 -0.2047135 -0.0000914 0.0002203 -0.0001339 -0.0296671 -0.6023081 0.242047 -0.0038205 0.2571167 -0.640527 0.0071653 -0.0008062 0.0067481 -0.2597318 -0.7809645 -0.094242 0.1681034 -0.2899749 -0.4015197 0.2248371 0.2797091 0.1861348 -0.6434526 -0.7724378 -0.0986584 -0.1640187 -0.297051 -0.4142844 -0.2317397 -0.263972 -0.192402 -0.6307878 -1.10326 -0.5964366 -0.0011522 -0.7323102 -0.408932 -0.0003344 -0.0014453 -0.0003498 -0.3997613 -0.3380535 0.0130764 0.0000612 -0.2464793 -0.5456034 -0.0004131 0.0008643 0.0007334 -0.2301072 -0.0616599 -0.241241 -0.0002237 0.1298089 -0.3872897 0.0001762 0.0005482 -0.0011015 -0.2270235 0.2063362 0.1822531 0.0003273 0.1822068 -0.0810883 -0.0001171 0.0006708 0.0000506 0.0547094 0.1368812 0.2063275 0.0004776 0.0203681 0.0410971 -0.000112 0.0007837 -0.0000384 0.0366907 -0.814664 -0.0624516 -0.0002631 -0.0774732 0.6490279 0.0006779 -0.0076189 0.0009163 -0.0713025 -0.0664794 -0.0783419 -0.0001691 0.0410394 -0.0330999 0.0001082 -0.0000513 -0.0000352 -0.1113592 -0.0984287 -0.2624954 -0.0004229 0.1432843 0.0257027 0.000378 0.0000247 0.0002198 -0.1806769 0.7593055 0.7204738 0.0014033 0.9772451 0.3038664 0.0006657 0.0017649 0.0007043 0.0922663 2.6862034 -0.0232974 -0.0002553 0.2187779 1.4160498 -0.0003966 -0.009842 -0.0003117 1.5759422 0.8156429 -0.3399706 -0.0000313 -0.8936759 0.3291939 0.000285 -0.0008159 0.0004358 -0.0938373 0.2211432 0.0370988 -0.0001518 0.0525244 0.2354263 -0.000212 -0.000169 -0.000748 0.3553526 0.0816901 -0.0008526 -0.000053 0.015654 -0.006705 -0.0002745 -0.0000036 -0.0002768 0.1853877 0.0679169 -0.0181128 -0.0000869 -0.0417288 -0.0381985 -0.0003409 -0.0000694 -0.0003196 0.1858053 0.3310685 0.1913187 0.0002341 0.1580684 0.161597 -0.0002618 0.0002076 -0.0002263 0.3915529 unknown
polarizability: 194.4121723|-3.8543521|113.1989519|0.0297918|0.0859943|50.8989338 unknown
InChI: InChI=1S/C8H4ClF3N2O/c9-3-1-4-5(2-6(3)15)14-7(13-4)8(10,11)12/h1-2,13,15H
charge 0 multiplicity 1
19 atoms
Cl -4.385809 1.48833 0.000453
F  3.819974 -1.225873 0.020148
F  3.688979 0.729636 -1.141885
F  3.687133 0.76565 1.120666
O  -4.013273 -1.429219 -0.003625
N  0.941036 1.112766 0.002637
N  0.985723 -1.180607 -0.000457
C  -0.398083 0.70491 0.001252
C  -0.349291 -0.730949 -0.000716
C  1.712374 -0.053578 0.001743
C  -1.615745 1.414293 0.001767
C  -1.544949 -1.484451 -0.002384
C  -2.769477 -0.789239 -0.002038
C  3.202555 0.024146 0.000404
C  -2.788989 0.645064 0.000053
H  1.2944 2.069354 0.005512
H  -1.672147 2.506024 0.00334
H  -1.507026 -2.579334 -0.003877
H  -3.903583 -2.412321 -0.004995
