program: Gaussian 09
title: 000198045
version: EM64L-G09RevD.01
frameworkgroup: C1[X(C17H23ClN2O2)]
method: RPBEPBE
basis: SDD
operation: Freq
keyword: #p
keyword: freq=noraman
keyword: PBEPBE/SDD
title: #p freq=noraman PBEPBE/SDD
converged: YES YES NO NO
title: Mulliken charges:
elementType: Cl O O N N C C C C C C C C C C C C C C C C C H H H H H H H H H H H H H H H H H H H H H H H
charge: -0.056457 -0.297965 -0.339688 -0.077973 -0.382061 -0.360037 -0.368518 -0.393018 -0.386432 -0.398687 -0.322228 -0.410193 0.153330 0.073257 0.325841 -0.312694 -0.280668 -0.267649 -0.123852 -0.337320 -0.080346 -0.535176 0.219567 0.175697 0.166995 0.205922 0.192571 0.203415 0.201686 0.189526 0.188876 0.212337 0.221874 0.191959 0.227468 0.247588 0.365139 0.290267 0.271311 0.260903 0.226507 0.224715 0.239723 0.229467 0.225022
chargesum: 0.00000
title: Mulliken charges with hydrogens summed into heavy atoms:
elementType: Cl O O N N C C C C C C C C C C C C C C C C C
charge: -0.056457 -0.297965 -0.339688 -0.077973 -0.016921 0.035227 0.004399 0.002968 0.004781 0.002525 0.091605 0.064863 0.153330 0.073257 0.325841 -0.022426 -0.009357 -0.006746 -0.123852 0.113902 0.159377 -0.080687
polarizability: 2.99726659e+02 -1.68816901e+01 2.35580761e+02 1.11593375e+01 -5.30870553e+00 1.34068363e+02
1716.lowfreq: -11.9282 -0.0017 -0.0012 0.0011 2.4404 4.6536 8.6713 14.1907 20.9567
frequency: -3.3918 14.0659 20.9390 39.6062 48.2466 55.1443 75.4346 87.2468 94.2391 115.1067 123.1841 145.9933 188.7035 204.4816 225.8392 241.7269 249.9042 284.7701 294.7960 309.6083 321.2016 331.0302 368.6423 378.3071 397.4065 433.1035 446.2403 449.6797 454.0609 496.2711 538.5364 570.7735 584.3876 597.7400 644.7936 663.2691 684.2445 704.9483 749.0351 751.6077 762.4020 800.9594 826.0889 834.8731 837.9936 849.5301 854.2368 858.3958 905.2426 921.1793 954.9778 958.2437 972.0692 985.7409 989.3600 990.9677 1004.4032 1010.5773 1036.8366 1048.7428 1062.2479 1086.7351 1099.3940 1102.7272 1115.6150 1129.1524 1148.4727 1148.8519 1153.3244 1157.5157 1198.2838 1200.8838 1224.3190 1251.8310 1254.5090 1263.6312 1268.1980 1269.0947 1286.0617 1291.0672 1303.4074 1322.4508 1330.4196 1339.1017 1343.9127 1345.4194 1353.8911 1375.6883 1377.3712 1389.0437 1391.3646 1432.0421 1446.6972 1450.1158 1458.3839 1460.5086 1461.4512 1464.8158 1472.4068 1475.4930 1480.8277 1522.1162 1563.7559 1581.8337 1611.7745 1665.5488 2819.4848 2834.5639 2893.9890 2962.4577 2966.5126 2982.6844 2985.8306 3014.6131 3020.7993 3023.0424 3032.4507 3036.9308 3043.6312 3044.9695 3054.1257 3092.0314 3095.3443 3121.4157 3152.4982 3182.2169 3187.0058 3206.9508 3459.3658
redmass: 2.9690 5.1485 6.2025 4.4667 3.3562 4.2211 4.3931 3.4015 6.4967 3.0177 3.3657 3.2434 4.4742 5.1820 2.4932 2.3307 3.0038 4.0197 4.8461 4.1448 2.7611 5.4421 2.7310 3.2199 2.5255 2.8068 3.7589 2.9311 3.2747 2.9163 3.0689 4.9986 2.6447 5.0009 2.3088 4.1114 3.3168 1.1748 1.8831 3.4824 3.2950 1.5137 2.2713 1.6072 1.4276 1.6648 2.2752 4.6548 2.3050 1.7034 1.3108 3.2704 1.3935 1.6923 1.3437 2.5311 4.5233 1.2534 2.7287 2.1218 2.1605 2.1701 1.9027 2.0105 2.3205 1.8100 1.4289 1.5962 1.9241 2.3686 3.6690 1.5492 1.2285 1.7416 1.3863 1.2216 1.3449 1.6624 1.2352 1.3581 1.1886 1.3102 1.3166 1.4344 1.3678 1.4736 1.4041 1.3853 5.0636 2.2371 1.8310 1.1970 1.1196 1.0916 1.0879 1.7747 1.1925 1.0855 1.0923 1.2318 1.0954 1.8411 8.0007 7.1110 6.2771 4.7337 1.0713 1.0706 1.0684 1.0573 1.0620 1.0615 1.0612 1.0900 1.0880 1.0600 1.0957 1.1051 1.0940 1.0974 1.1033 1.1053 1.0609 1.0951 1.0896 1.0953 1.0917 1.1146 1.0801
irintensity: 0.2111 0.5788 0.4182 0.9472 0.2911 0.3269 1.8654 0.2496 3.8134 2.0453 1.8265 2.0781 1.7622 0.4289 2.2334 2.8115 3.0423 1.9034 2.5828 2.4509 4.0828 0.4440 1.1596 27.7265 12.2624 3.9072 12.1086 0.1440 1.3741 1.2083 3.6002 0.7535 1.3723 11.1184 9.9463 28.8118 4.9668 77.5821 9.8772 18.4597 1.0991 0.0246 2.2414 17.2065 41.0036 12.6298 2.1912 94.1488 1.5760 13.4207 3.8162 173.1369 61.1275 12.0873 1.4632 21.8320 3.2768 16.1331 10.8488 7.8248 11.9409 19.6501 17.8071 37.5677 19.7632 13.1824 5.2429 4.0030 11.2745 48.5140 138.7143 39.9361 1.9613 12.9296 17.4939 3.0805 8.9867 86.4275 0.5448 7.0992 7.4548 4.8583 0.9881 0.5234 14.2512 3.2147 3.1767 12.0848 4.4518 32.9975 13.4424 33.8548 24.6163 8.1967 14.7533 133.8677 6.9065 7.0553 3.4163 15.4817 12.4047 261.7922 5.7579 155.9627 211.7096 1.9433 68.3801 113.6050 74.6267 32.8296 39.0058 36.2210 36.6103 1.0379 85.3092 40.3882 71.8115 20.9568 41.8476 1.3515 102.9028 16.2796 7.9339 8.0060 3.1615 3.3645 2.3854 18.4797 160.5385
temp: 298.150 k
press: 1.00000 atm
elementType: 17 8 8 7 7 6 6 6 6 6 6 6 6 6 6 6 6 6 6 6 6 6 1 1 1 1 1 1 1 1 1 1 1 1 1 1 1 1 1 1 1 1 1 1 1
symmnumber: 1
zpe: 975744.9 jmol-1
zpe.correction: 0.371642 hartree
zpe.thermalcorrener: 0.393091 hartree
zpe.thermalcorrenthalpy: 0.394035 hartree
zpe.thermalcorrgfe: 0.318220 hartree
zpe.sumelectzpe: -1379.923820 hartree
zpe.sumelectthermal: -1379.902371 hartree
zpe.sumelectthermalent: -1379.901427 hartree
zpe.sumelectthermalfe: -1379.977242 hartree
dipole: 0.2657 5.2277 0.9000
dipole: 5.3113
quadrupole: -139.3409 -128.2691 -140.6185
quadrupole: 7.4376 -4.2210 -1.5922
quadrupole: -3.2647 7.8071 -4.5423 7.4376 -4.2210 -1.5922
hfenergy: -1380.2954619 hartree
pointgroup: C01 [X(C17H23Cl1N2O2)]
dipole: -0.0867914 -1.967913 0.6973415 debye
polarizability: 298.7315146|-2.7143646|206.0205307|-28.0153806|-43.6674355|164.623738 unknown
InChI: InChI=1S/C17H23ClN2O2/c1-2-12-22-16-13-14(18)6-7-15(16)17(21)19-8-11-20-9-4-3-5-10-20/h2,6-7,13,19H,1,3-5,8-12H2
charge 0 multiplicity 1
45 atoms
Cl 6.521748 0.018414 -1.452532
O  0.094978 2.172747 -0.725042
O  1.914429 -1.46445 0.56176
N  -3.968566 0.279544 -0.04584
N  -0.196291 0.200625 0.469736
C  -4.294816 1.666756 -0.473967
C  -4.944104 -0.696963 -0.59479
C  -5.705312 2.074064 -0.003954
C  -6.377703 -0.365539 -0.1292
C  -6.762992 1.076849 -0.529617
C  -2.560031 -0.082244 -0.326041
C  -1.608389 0.480483 0.762528
C  0.567362 1.076127 -0.272098
C  2.018027 0.708264 -0.519026
C  2.677707 -0.496555 -0.121409
C  2.782834 1.676328 -1.215357
C  4.050167 -0.701903 -0.406662
C  4.147282 1.495652 -1.516252
C  4.755092 0.299453 -1.097208
C  2.562583 -2.743007 0.955701
C  1.491053 -3.631749 1.525731
C  1.541575 -4.165154 2.770596
H  -3.540096 2.357661 -0.058455
H  -4.238591 1.75757 -1.591473
H  -4.921342 -0.709819 -1.717843
H  -4.657475 -1.707819 -0.247861
H  -5.927005 3.100183 -0.355407
H  -5.723355 2.085904 1.103062
H  -6.424299 -0.467986 0.972465
H  -7.085461 -1.096246 -0.566716
H  -6.815344 1.148309 -1.636161
H  -7.767139 1.332263 -0.141119
H  -2.215873 0.285037 -1.322861
H  -2.476167 -1.186237 -0.337259
H  -1.874287 0.039881 1.739362
H  -1.727518 1.574915 0.828468
H  0.243655 -0.670826 0.785434
H  2.253387 2.587148 -1.514321
H  4.571557 -1.610236 -0.099289
H  4.71622 2.257852 -2.05388
H  3.359337 -2.53931 1.696819
H  3.011568 -3.198346 0.048849
H  0.651561 -3.859155 0.854987
H  0.759426 -4.838882 3.136191
H  2.3675 -3.946906 3.458849
