program: Gaussian 09
title: 000197994
version: EM64L-G09RevD.01
frameworkgroup: C1[X(C7H11BrO3)]
method: RPBEPBE
basis: SDD
operation: Freq
keyword: #p
keyword: freq=noraman
keyword: PBEPBE/SDD
title: #p freq=noraman PBEPBE/SDD
converged: YES YES NO NO
title: Mulliken charges:
elementType: Br O O O C C C C C C C H H H H H H H H H H H
charge: 0.009148 -0.276755 -0.192942 -0.245873 -0.405064 -0.475354 -0.278456 0.287567 -0.779192 0.305061 -0.754393 0.225943 0.219558 0.274850 0.241064 0.238972 0.260374 0.316135 0.285762 0.245134 0.251608 0.246853
chargesum: 0.00000
title: Mulliken charges with hydrogens summed into heavy atoms:
elementType: Br O O O C C C C C C C
charge: 0.009148 -0.276755 -0.192942 -0.245873 0.040436 0.040560 0.220890 0.287567 -0.177295 0.305061 -0.010798
polarizability: 9.26940609e+01 5.20785210e+00 1.14905963e+02 4.87179906e+00 -2.61256803e+00 8.04976290e+01
1716.lowfreq: -9.4016 -6.1217 -0.0007 -0.0007 0.0001 7.7683 12.9327 24.5273 28.1680
frequency: 12.7071 24.4572 28.1451 35.4120 58.5803 92.5710 136.5566 162.1903 199.6639 223.3796 286.7215 369.9950 392.8043 441.3105 447.5239 567.0820 591.5556 599.6520 616.0876 721.5171 797.7251 837.4161 885.6177 897.6430 935.8592 993.4300 1015.3210 1036.3609 1044.6023 1056.9913 1119.8598 1165.1875 1179.7614 1196.4382 1205.5095 1221.3426 1272.2307 1342.6184 1359.9629 1369.4728 1383.6067 1423.1804 1429.0587 1446.2182 1454.6007 1456.5805 1479.3613 1622.2489 1650.4299 2968.2292 3005.1563 3011.6532 3022.1364 3039.9011 3054.9916 3070.8383 3090.7743 3099.0750 3138.9453 3158.3603
redmass: 8.9797 2.6316 1.5101 3.5068 4.7891 4.8928 5.5296 3.7512 3.0924 3.3494 2.2627 2.9035 2.5699 3.6082 2.8101 3.1631 3.8096 4.2113 3.5758 2.2942 2.8378 2.4500 2.1814 2.4156 3.5313 1.7523 2.5135 1.3832 1.6483 1.8968 2.0551 1.3134 1.3374 1.8246 2.1836 1.2127 1.2216 1.5666 1.4878 1.4912 1.2576 1.0963 1.1075 1.0874 1.0588 1.0536 1.0795 8.3145 9.8516 1.0658 1.0384 1.0605 1.0594 1.0914 1.0570 1.1014 1.1077 1.0938 1.1025 1.1105
irintensity: 0.3629 1.2481 0.3430 2.1352 2.5500 1.9956 0.8398 2.3476 18.0573 10.4554 3.3821 4.4837 3.9196 1.5343 1.9580 4.6571 8.7056 15.1371 8.8851 10.2108 8.2278 2.6750 1.9477 8.5974 52.9242 22.9476 60.7190 7.5975 13.1521 16.7166 6.9739 12.8326 34.2485 136.8926 219.4856 9.9988 16.0855 24.6362 18.9813 2.5075 49.4020 34.9134 23.2375 19.3792 18.1551 18.0200 15.8920 82.8715 211.3433 21.7216 2.5538 18.8986 13.6295 6.0138 11.1399 13.0240 27.8458 10.6608 9.7859 1.4700
temp: 298.150 k
press: 1.00000 atm
elementType: 35 8 8 8 6 6 6 6 6 6 6 1 1 1 1 1 1 1 1 1 1 1
symmnumber: 1
zpe: 448280.3 jmol-1
zpe.correction: 0.170741 hartree
zpe.thermalcorrener: 0.184127 hartree
zpe.thermalcorrenthalpy: 0.185071 hartree
zpe.thermalcorrgfe: 0.125140 hartree
zpe.sumelectzpe: -511.603493 hartree
zpe.sumelectthermal: -511.590107 hartree
zpe.sumelectthermalent: -511.589163 hartree
zpe.sumelectthermalfe: -511.649093 hartree
dipole: 1.6319 0.6481 4.2515
dipole: 4.5998
quadrupole: -77.3571 -70.9101 -79.6260
quadrupole: 3.6012 -4.3068 3.9671
quadrupole: -1.3927 5.0543 -3.6616 3.6012 -4.3068 3.9671
hfenergy: -511.7742338 hartree
pointgroup: C01 [X(C7H11Br1O3)]
dipole: 0.7245737 -0.2538899 -1.6387754 debye
dipolederiv: -0.1756193 0.1137405 -0.0164509 0.0208076 -0.3762907 0.0655385 -0.0020207 0.052951 -0.1123545 -1.4010193 0.4568432 0.1649457 0.5692687 -0.559213 -0.0080317 0.1721748 0.0082412 -0.4904116 -0.4145662 -0.1918229 -0.0895719 -0.099062 -0.5499648 0.1166168 -0.1575051 0.1962459 -0.7208225 -0.6991377 0.1204152 0.0999022 0.0377676 -0.4085355 0.1810063 0.4360827 0.0342686 -0.8255642 0.0395132 0.0295593 0.0069592 0.0606069 0.0927198 0.0154747 0.0133378 -0.0270815 0.0882675 -0.0324382 -0.1600695 -0.088933 -0.1344163 -0.1235451 -0.0792048 -0.1996865 -0.1313518 -0.2405405 0.6009749 -0.1381422 0.0625345 -0.2664309 0.4021426 -0.0106897 0.2020227 -0.0660123 0.2252703 0.3379525 0.5944944 0.2114261 0.391235 0.8868224 -0.0886307 0.2933145 -0.1187312 0.808753 0.1730634 -0.3999677 0.0040434 -0.3185899 0.0508593 0.038012 -0.0047294 -0.0115722 0.0572912 1.5372301 -0.5544735 -0.2525749 -0.5579735 0.6001676 -0.2705901 -0.6286804 -0.0945397 1.0521452 -0.1124802 0.1210107 -0.0730441 0.189452 -0.1865731 0.1975957 -0.0864983 0.1482232 -0.126653 -0.0124056 0.0992753 -0.0345828 0.0589738 0.0249455 0.0555773 -0.0107668 0.1189288 0.0262011 0.0252262 -0.0920054 -0.0429891 -0.0769301 -0.0025321 -0.0765128 -0.0125939 -0.1240093 -0.0505494 0.1158184 0.0278664 -0.0734262 0.0318829 -0.0239991 0.0605608 -0.022653 0.0662331 0.092337 -0.0738473 0.0176493 0.0973783 -0.0048453 0.0701615 -0.0610559 0.1079307 -0.0173234 0.0264783 -0.0725469 -0.0880789 0.045169 -0.0086052 -0.0477817 0.0575772 -0.017272 0.0738833 0.0515009 0.0336481 0.0389057 -0.052457 0.0274371 -0.0387747 -0.0853051 -0.0927838 -0.0410466 -0.0084682 -0.0213886 -0.0065089 -0.0538127 0.0402309 -0.0126781 0.0192769 -0.0872271 -0.0298336 0.0555055 0.0472891 0.035141 0.0578741 0.0879499 0.0188224 -0.0502529 0.0757902 -0.0032679 -0.0219813 0.1037465 0.0360121 0.0522535 0.0150148 0.103046 -0.0690445 0.0248618 -0.0301374 -0.0699505 0.0963154 -0.0734239 -0.0293327 -0.0459179 -0.0444219 -0.0175314 -0.0383055 -0.0330507 0.0945204 -0.0953283 0.0135798 0.0046893 -0.0178563 0.1246226 0.0096133 0.0352075 0.0289825 0.0890253 unknown
polarizability: 101.3124384|-12.1902865|103.773311|-0.5006445|-9.1925791|83.0119034 unknown
InChI: InChI=1S/C7H11BrO3/c1-6(9)11-4-2-3-7(10)5-8/h2-5H2,1H3
charge 0 multiplicity 1
22 atoms
Br 1.737907 2.795843 -0.4736
O  -1.477572 -0.452328 -0.476055
O  2.38229 -0.444485 1.2847
O  -3.078064 -0.240405 1.204374
C  0.513611 -1.840701 -0.387534
C  1.422219 -0.731183 -0.952795
C  -0.65417 -1.301226 0.440543
C  2.263625 -0.021925 0.10423
C  3.027267 1.230619 -0.330799
C  -2.679452 0.036624 0.051096
C  -3.374685 0.938787 -0.945877
H  1.106164 -2.509982 0.263657
H  0.115352 -2.446052 -1.222178
H  0.822648 0.017298 -1.504603
H  2.130923 -1.158286 -1.694674
H  -1.289656 -2.112843 0.836188
H  -0.316575 -0.678994 1.287519
H  3.766039 1.523123 0.428054
H  3.471679 1.137783 -1.334183
H  -3.123571 0.657636 -1.980027
H  -3.044422 1.981374 -0.783091
H  -4.463056 0.896921 -0.786646
