program: Gaussian 09
title: 000198129
version: EM64L-G09RevD.01
frameworkgroup: C1[X(C22H24N4O2)]
method: RPBEPBE
basis: SDD
operation: Freq
keyword: #p
keyword: freq=noraman
keyword: PBEPBE/SDD
title: #p freq=noraman PBEPBE/SDD
converged: YES YES NO NO
title: Mulliken charges:
elementType: O O N N N N C C C C C C C C C C C C C C C C C C C C C C H H H H H H H H H H H H H H H H H H H H H H H H
charge: -0.308490 -0.318437 -0.397742 -0.144627 -0.462151 -0.642529 -0.200279 -0.601884 0.455564 0.529073 0.304224 -0.418297 -0.380681 -0.448396 -0.390390 -0.246385 -0.245186 -0.372040 -0.241696 -0.232865 -0.257204 -0.299657 0.298279 0.014946 -0.250404 0.266730 -0.249450 -0.663002 0.260117 0.198676 0.232120 0.277420 0.242873 0.265068 0.226558 0.252995 0.222155 0.225444 0.222998 0.227500 0.222402 0.226696 0.231843 0.225910 0.327746 0.304982 0.360360 0.234322 0.222020 0.215531 0.252705 0.224535
chargesum: 0.00000
title: Mulliken charges with hydrogens summed into heavy atoms:
elementType: O O N N N N C C C C C C C C C C C C C C C C C C C C C C
charge: -0.308490 -0.318437 -0.120322 -0.144627 -0.134405 0.022813 0.059838 -0.171088 0.455564 0.529073 0.304224 -0.175424 -0.115613 -0.221838 -0.137395 -0.024230 -0.019742 -0.149042 -0.014196 -0.010462 -0.030508 -0.067814 0.298279 0.014946 -0.024494 0.266730 0.206892 0.029769
polarizability: 3.90881067e+02 -1.90342750e+01 2.76563578e+02 2.85347335e+01 1.38222231e+01 1.92585602e+02
1716.lowfreq: -6.3566 -0.0006 -0.0005 0.0005 1.3474 3.4519 6.7051 16.9026 23.3167
frequency: 4.9671 16.7921 23.2906 26.1407 38.9433 46.0069 48.0078 54.6376 67.2839 79.0076 99.7211 130.6939 139.7006 160.4253 186.6067 203.1990 214.3727 229.0433 245.1252 268.5727 292.3427 311.6139 316.7206 318.9077 350.4501 376.3270 401.3069 403.1785 422.1525 443.3183 449.1313 468.3461 479.1452 515.0382 535.1607 559.5209 560.7789 566.4689 610.5809 615.9772 618.4713 622.3249 637.3062 656.2938 660.7651 677.0417 703.1277 705.6627 722.8033 727.4681 740.0229 752.6802 759.6920 770.5775 789.2144 799.3595 802.7185 852.0013 855.6574 857.5115 862.3100 887.8607 921.1177 922.3707 928.2356 949.3172 960.1077 975.5422 979.7100 990.2011 990.2923 994.7693 996.3577 1023.0029 1029.8707 1036.8764 1040.3938 1077.7595 1086.9513 1095.0640 1101.3892 1117.4176 1156.0066 1167.0406 1171.3977 1172.4426 1177.4518 1186.8037 1193.7683 1198.7977 1212.0774 1218.5413 1250.3834 1271.4526 1276.9382 1280.5752 1281.4887 1316.1684 1325.4222 1332.4873 1356.7124 1362.1748 1380.4540 1383.2186 1384.4968 1388.8939 1436.9021 1438.3348 1440.4905 1453.8647 1458.6768 1462.6761 1466.2956 1484.3705 1484.5656 1489.1139 1497.8422 1513.3648 1570.8999 1591.3814 1592.7713 1607.2077 1613.2391 1617.1781 1622.6694 1664.1376 2958.4083 2991.5360 3005.0965 3028.3679 3029.1288 3086.6953 3091.4421 3108.8734 3117.5999 3120.6780 3122.6191 3123.8397 3128.1107 3134.3709 3141.2576 3145.1565 3151.0966 3155.8981 3160.9913 3163.7060 3362.0019 3523.2575 3565.0742 3614.4113
redmass: 4.4502 4.7073 3.8079 4.0110 4.6887 4.5174 3.7582 4.3567 6.0733 4.3709 4.5326 5.5221 4.3334 3.1925 4.2320 4.2155 5.6763 1.4468 3.7801 4.5438 4.6707 3.2183 2.6401 4.5833 3.9461 3.7284 2.8077 2.8126 3.0430 1.7131 3.1545 2.4032 3.3918 3.1862 3.9624 1.3796 4.6936 3.7830 3.9784 5.6755 1.6954 3.9425 5.2210 3.4147 4.5572 3.0733 2.0355 1.8131 1.7649 3.3195 1.6363 3.9498 2.1605 1.8076 3.6696 3.3661 1.2647 1.3000 1.3004 2.6713 3.1870 1.9791 1.3640 1.7940 1.5319 3.3439 2.6751 1.4242 1.3816 4.5673 4.3992 1.5044 1.3305 2.7073 2.2361 4.2852 2.2987 1.8085 1.8875 2.1552 1.9737 2.4626 1.6882 1.4052 1.0709 1.0521 3.0649 1.5452 1.1743 1.4504 1.8213 1.7249 1.6716 1.8044 1.7568 1.7443 1.1126 1.5320 1.5700 1.2815 1.2471 1.4745 5.4628 5.2602 5.8941 1.2367 2.2039 3.4852 2.1432 1.2111 1.3074 1.0501 1.3527 1.0794 2.1301 2.2723 3.9167 1.9620 2.9879 5.9718 5.8259 6.8725 5.7426 5.9380 2.4508 2.4521 1.0595 1.0361 1.0959 1.0597 1.0861 1.0974 1.1033 1.0871 1.1057 1.0844 1.0860 1.0889 1.0878 1.0915 1.0930 1.0957 1.0949 1.0968 1.1015 1.1009 1.0590 1.0755 1.0768 1.0914
irintensity: 0.4638 0.2567 0.0775 1.4738 1.5200 0.4478 0.3186 0.1072 2.0016 0.4223 1.7491 1.6656 1.5069 1.1611 0.8793 4.4207 8.0662 3.7548 3.5182 2.9530 5.9097 5.9217 2.7886 8.8189 13.6772 11.8616 1.1980 0.0419 11.4786 66.7563 20.1839 31.4867 16.7375 22.9735 11.5807 14.6846 22.3325 22.8469 38.4555 0.7250 65.9903 2.5766 17.5744 7.3550 23.7538 10.8347 35.7051 48.9035 182.9637 29.3275 53.2476 37.7996 36.5414 93.1423 9.6790 4.1718 7.3016 0.8507 0.2911 9.0340 6.7362 1.1723 2.0848 1.6441 7.7938 11.1364 53.1651 0.5256 0.1695 0.1288 0.0475 0.6949 1.0369 10.8409 15.5961 293.9473 18.5134 12.4439 16.8412 55.8440 41.9287 33.6861 68.3221 6.1062 1.3457 0.0626 302.3521 6.4823 3.3012 4.5795 1.4673 2.1612 33.9482 25.6094 20.9165 131.9006 2.5041 9.3948 93.0100 7.4466 0.4656 1.5706 13.5801 0.7710 1.7637 30.9144 2.6035 31.4857 0.8695 10.3787 26.7402 14.7404 4.2204 6.7805 8.0508 44.2949 883.9993 35.7220 135.2758 1.0847 1.2894 323.2439 10.0120 24.3964 449.1633 71.5448 42.8917 23.1179 12.7912 40.9412 20.8317 40.8023 1.5912 9.9788 37.9109 1.8023 0.2187 16.1321 3.0211 19.8723 19.5573 31.9318 42.8897 10.9262 25.9226 24.4717 254.7794 32.1422 42.5589 61.2885
temp: 298.150 k
press: 1.00000 atm
elementType: 8 8 7 7 7 7 6 6 6 6 6 6 6 6 6 6 6 6 6 6 6 6 6 6 6 6 6 6 1 1 1 1 1 1 1 1 1 1 1 1 1 1 1 1 1 1 1 1 1 1 1 1
symmnumber: 1
zpe: 1106171.4 jmol-1
zpe.correction: 0.421318 hartree
zpe.thermalcorrener: 0.447376 hartree
zpe.thermalcorrenthalpy: 0.448320 hartree
zpe.thermalcorrgfe: 0.359742 hartree
zpe.sumelectzpe: -1220.218749 hartree
zpe.sumelectthermal: -1220.192691 hartree
zpe.sumelectthermalent: -1220.191747 hartree
zpe.sumelectthermalfe: -1220.280325 hartree
dipole: -0.9404 0.5428 1.8765
dipole: 2.1681
quadrupole: -132.4648 -161.3245 -158.9917
quadrupole: -4.8548 3.5618 2.4050
quadrupole: 18.4622 -10.3975 -8.0647 -4.8548 3.5618 2.4050
hfenergy: -1220.6400669 hartree
pointgroup: C01 [X(C22H24N4O2)]
dipole: 0.4246171 0.4375094 -0.5965385 debye
polarizability: 365.4155995|26.458776|285.051849|64.7324387|17.5985515|209.5627983 unknown
InChI: InChI=1S/C22H24N4O2/c1-2-28-22(27)25-18-13-14-20(26-21(18)23)24-19(17-11-7-4-8-12-17)15-16-9-5-3-6-10-16/h3-14,19,24-25H,2,15,23H2,1H3
charge 0 multiplicity 1
52 atoms
O  5.929741 1.589885 1.096064
O  4.696155 -0.303627 1.773098
N  -1.326641 -0.240236 -1.30474
N  0.378873 -0.188446 0.318713
N  3.85676 1.30306 0.243993
N  1.93851 -0.144181 2.056201
C  -2.302459 -0.865058 -0.39135
C  -3.606321 -0.032093 -0.310389
C  -2.536578 -2.341908 -0.769244
C  -3.435276 1.42557 0.108558
C  -0.023959 0.091104 -0.954556
C  -3.796847 -2.866147 -1.150308
C  -1.420387 -3.221535 -0.73771
C  -4.315334 2.406191 -0.418737
C  -2.46232 1.837293 1.055759
C  -3.938639 -4.231307 -1.496405
C  -1.559244 -4.58269 -1.077941
C  0.854011 0.695209 -1.905265
C  -2.822343 -5.094815 -1.462152
C  -4.240369 3.755589 -0.00682
C  -2.382367 3.186018 1.468938
C  2.146776 1.03178 -1.475044
C  2.572834 0.78882 -0.146768
C  1.638447 0.148015 0.737966
C  -3.272234 4.151511 0.944234
C  4.797091 0.754902 1.084608
C  7.067538 1.121743 1.937557
C  7.945894 0.128338 1.172012
H  -1.801554 -0.85435 0.59386
H  -4.13151 -0.063673 -1.286624
H  -4.276877 -0.538645 0.414768
H  -1.613844 -0.081387 -2.270562
H  -4.680696 -2.220698 -1.179865
H  -0.442064 -2.825475 -0.44134
H  -5.070166 2.108086 -1.158008
H  -1.745707 1.113214 1.458942
H  -4.921422 -4.617944 -1.790064
H  -0.686858 -5.24521 -1.042573
H  0.526647 0.897558 -2.929226
H  -2.932553 -6.152105 -1.728372
H  -4.93269 4.49413 -0.427353
H  -1.619126 3.483198 2.197308
H  2.844408 1.50279 -2.178451
H  -3.208008 5.196919 1.266619
H  4.158131 2.168118 -0.212289
H  1.20197 -0.617682 2.578642
H  2.923727 -0.297914 2.312764
H  6.659942 0.667371 2.8577
H  7.60685 2.051467 2.180608
H  8.825708 -0.142183 1.785356
H  7.384801 -0.794619 0.949139
H  8.306676 0.567852 0.225947
