program: Gaussian 09
title: 000197878
version: EM64L-G09RevD.01
frameworkgroup: C1[X(C4H11O2PS)]
method: RPBEPBE
basis: SDD
operation: Freq
keyword: #p
keyword: freq=noraman
keyword: PBEPBE/SDD
title: #p freq=noraman PBEPBE/SDD
converged: YES YES NO NO
title: Mulliken charges:
elementType: S P O O C C C C H H H H H H H H H H H
charge: -0.291774 0.767479 -0.489304 -0.637311 -0.619996 -0.638502 -0.211513 -0.651139 0.280416 0.273713 0.229831 0.239275 0.246341 0.215199 0.231001 0.209029 0.231230 0.231717 0.384308
chargesum: 0.00000
title: Mulliken charges with hydrogens summed into heavy atoms:
elementType: S P O O C C C C
charge: -0.291774 0.767479 -0.489304 -0.253003 -0.065867 0.076945 0.234687 0.020837
polarizability: 1.00399590e+02 2.27357785e-01 9.96842284e+01 -9.54307853e-01 -4.82708170e+00 7.42249167e+01
1716.lowfreq: -16.6083 -7.6935 -0.0026 -0.0015 -0.0015 11.2528 27.5996 49.3169 59.8860
frequency: 27.0386 49.0073 59.8314 102.8174 143.0240 181.1128 205.9997 228.9268 250.9988 273.8574 297.5514 325.9651 338.1148 438.3051 489.4909 666.3918 680.3377 705.7597 780.0254 810.4158 885.8616 998.0319 1020.8260 1023.5687 1063.2746 1067.2096 1105.3385 1136.9988 1246.7973 1258.3945 1287.5488 1352.9752 1393.5799 1401.3660 1423.2122 1459.8970 1475.3319 1476.9335 1486.1425 1486.3618 2978.3385 2994.2247 2995.4921 3032.7042 3043.1429 3089.0716 3090.6728 3095.1227 3108.3107 3114.8825 3569.9729
redmass: 2.5050 2.7890 2.6171 3.4020 3.3970 2.4307 3.1126 1.4636 1.3571 2.8876 3.2937 3.8611 1.3315 4.4947 8.0945 5.7734 6.3942 4.9231 1.2953 1.1058 3.7231 1.5174 2.4751 1.3417 1.8090 1.5698 2.1652 1.4642 1.1852 1.1391 1.3371 1.2541 1.2419 1.1875 1.0794 1.0405 1.0363 1.0548 1.0480 1.0758 1.0559 1.0366 1.0357 1.0592 1.1077 1.1003 1.0982 1.1010 1.1021 1.1030 1.0662
irintensity: 0.1176 2.5927 0.1127 0.9248 2.1621 16.9849 18.2025 3.6825 18.0346 11.6517 5.6597 9.2776 79.8254 6.4912 16.5348 91.9523 92.5545 98.8348 53.9981 4.4987 165.8073 25.9779 127.3885 48.8552 17.8054 35.0225 9.3128 7.6549 4.8722 1.6638 5.5681 8.2202 24.7380 19.1437 7.0969 12.2788 17.1784 5.0235 8.3072 14.0148 34.6517 28.9268 20.6424 4.6726 17.4091 10.5940 29.8537 9.6869 33.8480 14.6763 40.1362
temp: 298.150 k
press: 1.00000 atm
elementType: 16 15 8 8 6 6 6 6 1 1 1 1 1 1 1 1 1 1 1
symmnumber: 1
zpe: 396063.0 jmol-1
zpe.correction: 0.150852 hartree
zpe.thermalcorrener: 0.162775 hartree
zpe.thermalcorrenthalpy: 0.163719 hartree
zpe.thermalcorrgfe: 0.111529 hartree
zpe.sumelectzpe: -1048.093137 hartree
zpe.sumelectthermal: -1048.081215 hartree
zpe.sumelectthermalent: -1048.080271 hartree
zpe.sumelectthermalfe: -1048.132461 hartree
dipole: -0.6849 -1.5715 0.5390
dipole: 1.7970
quadrupole: -56.7469 -70.2192 -63.1231
quadrupole: -3.8035 -1.7302 6.1858
quadrupole: 6.6161 -6.8561 0.2400 -3.8035 -1.7302 6.1858
hfenergy: -1048.2439899 hartree
pointgroup: C01 [X(C4H11O2P1S1)]
dipole: -0.258023 -0.2472547 0.6100344 debye
dipolederiv: -0.5192095 0.0226787 0.0117773 0.0013314 -0.5219321 0.1500065 0.054592 0.0777903 -0.6881256 1.7241191 0.0667016 -0.0762275 0.2407181 1.2964284 -0.092321 -0.1196404 -0.08632 1.6769585 -1.6680753 0.0435253 0.1811348 0.1334597 -0.5379631 0.0533047 0.1177428 0.0941791 -0.5811187 -0.7371069 -0.0920413 -0.0799431 -0.1532135 -0.6977061 -0.3193637 -0.1267954 -0.3231077 -0.8780702 -0.1083137 -0.083396 0.0695076 -0.0897785 -0.0267652 -0.0301843 -0.0189379 0.1398804 -0.1549102 -0.0418338 -0.0208915 0.0138249 0.1505951 -0.0320362 0.0205352 -0.030688 0.0302197 0.0323115 0.9514325 -0.0322078 -0.1152143 -0.4242574 0.2611587 0.139942 0.1811355 0.0556795 0.2657166 -0.1593273 -0.0777736 0.0149731 -0.0099512 0.0092968 -0.0237886 -0.0103426 -0.0135622 0.0707001 0.0352031 0.0393893 0.0129852 0.0181542 0.0338425 0.0826099 0.0606425 0.0421138 -0.0361488 0.0191758 -0.0291317 -0.0361716 -0.0394513 0.0021497 -0.0578873 -0.0565078 -0.0609203 0.0409959 -0.0353508 0.1172276 -0.0245249 0.1142911 -0.0778861 0.0470963 -0.0176553 0.0426497 0.1151425 0.0939235 -0.0206971 0.0115891 -0.0544312 0.1105969 0.0566815 0.0774302 0.0362552 -0.0821879 0.0684917 -0.0434101 -0.0122649 -0.1020661 0.0190582 -0.1032975 -0.0585744 -0.0877231 0.0212614 -0.0671078 -0.0004179 -0.0038006 0.0866016 -0.082545 -0.1165804 0.0128301 -0.1369924 -0.0257999 0.0272864 -0.0265668 0.0516379 0.0606627 0.0291878 0.044613 -0.0499815 0.0828477 -0.0560384 -0.142967 0.0783964 -0.0205903 0.0957999 0.0277003 0.0293608 -0.0430914 0.0253023 0.1082456 0.111042 0.0266951 0.0314125 -0.0282509 -0.0332745 -0.1065639 0.0155351 -0.1189408 -0.0180917 0.1098295 -0.0025071 -0.0130065 -0.0526332 0.0472748 0.080483 0.0363364 0.0970638 -0.0933295 0.3387886 0.0344269 -0.0170985 0.0524193 0.1734143 0.1453538 -0.0240299 0.103585 0.282489 unknown
polarizability: 100.1416721|-2.1225569|81.2033558|-1.7984239|-12.1412119|92.9637072 unknown
InChI: InChI=1S/C4H11O2PS/c1-3-6-7(5,8)4-2/h5H,3-4H2,1-2H3
charge 0 multiplicity 1
19 atoms
S  0.572294 0.956532 -2.168492
P  0.483187 0.06137 -0.295776
O  -1.082068 -0.493018 0.214973
O  1.042783 1.113126 0.98608
C  1.453249 -1.477992 0.087866
C  2.966522 -1.283373 -0.110935
C  -2.298762 0.302196 -0.110529
C  -3.480615 -0.663419 -0.069309
H  1.201589 -1.7323 1.132239
H  1.04564 -2.265918 -0.567479
H  3.490747 -2.233806 0.092195
H  3.20061 -0.976221 -1.145582
H  3.360952 -0.51698 0.577535
H  -2.401587 1.102485 0.64665
H  -2.175287 0.759793 -1.112124
H  -4.419732 -0.1142 -0.267785
H  -3.366914 -1.45161 -0.832569
H  -3.560247 -1.142182 0.921532
H  1.041842 2.067519 0.71391
