program: Gaussian 09
title: 000197892
version: EM64L-G09RevD.01
frameworkgroup: C1[X(C11H15NO4)]
method: RPBEPBE
basis: SDD
operation: Freq
keyword: #p
keyword: freq=noraman
keyword: PBEPBE/SDD
title: #p freq=noraman PBEPBE/SDD
converged: YES YES NO NO
title: Mulliken charges:
elementType: O O O O N C C C C C C C C C C C H H H H H H H H H H H H H H H
charge: -0.300044 -0.336876 -0.238513 -0.422305 -0.370568 0.026420 0.302695 -0.693651 -0.712834 0.242080 -0.345836 -0.347979 -0.233630 -0.231485 0.310715 -0.317472 0.189249 0.205988 0.239603 0.264859 0.202215 0.222300 0.258206 0.238030 0.250231 0.225058 0.229080 0.332580 0.211723 0.263400 0.336759
chargesum: 0.00000
title: Mulliken charges with hydrogens summed into heavy atoms:
elementType: O O O O N C C C C C C C C C C C
charge: -0.300044 -0.336876 -0.238513 -0.085546 -0.037987 0.215669 0.302695 0.016799 -0.030112 0.242080 -0.107805 -0.097748 -0.008572 -0.002405 0.310715 0.157650
polarizability: 1.83381276e+02 1.00837055e+01 1.45603302e+02 -8.47273303e+00 1.62291377e+00 9.28174728e+01
1716.lowfreq: -12.8876 -0.0008 -0.0002 0.0004 5.1535 7.2884 46.9626 49.3210 63.6788
frequency: 46.8634 49.3110 63.6647 73.9184 93.6400 99.2195 114.6081 149.7271 182.3246 198.6145 225.8637 250.7528 265.3092 295.1251 300.3673 328.6148 342.0722 389.8947 441.8025 455.5434 480.1666 508.8904 540.9392 583.8997 601.3721 610.3308 645.6235 697.2433 725.1102 741.2850 754.9501 790.2153 844.7918 849.8081 873.2517 914.5114 919.2237 927.8577 933.2908 947.2333 966.8085 1031.5642 1033.6051 1070.8336 1095.1348 1104.0081 1148.4081 1153.6931 1166.9004 1183.3383 1189.5652 1231.5260 1240.6086 1265.7849 1318.1055 1321.9033 1339.7097 1381.7997 1386.6830 1401.0222 1404.6446 1439.0935 1446.6314 1456.9520 1469.2107 1473.4901 1476.5445 1484.8115 1494.2742 1587.0411 1610.8256 1706.2062 2963.8464 2987.0177 2993.7942 3003.6898 3086.2269 3091.7978 3093.0025 3106.8453 3130.6809 3133.6496 3149.2430 3160.2267 3174.5836 3554.3360 3560.8684
redmass: 5.3308 5.0972 4.1707 3.0572 4.2093 4.6571 4.5035 3.9116 2.7696 1.2230 2.4034 1.4273 2.4525 4.7611 2.6085 2.0877 2.6071 3.0315 2.9099 3.2255 4.5050 4.4018 4.1378 4.4679 1.3163 6.0618 5.2830 7.3367 4.1193 3.6193 1.3962 4.3150 1.6754 2.8020 4.0525 5.3143 3.6726 1.3992 1.2903 1.3306 1.3031 1.8629 1.7143 5.1102 2.4536 1.8904 2.1134 2.0589 1.1192 1.9416 1.9706 1.6926 2.5832 1.5047 1.2890 1.1836 1.4345 5.4688 1.3432 1.1996 1.1425 2.3670 1.0837 1.0511 1.0660 1.4064 1.3664 2.2097 1.0614 7.0387 7.1910 9.6516 1.0840 1.0354 1.0367 1.0677 1.0988 1.0996 1.1011 1.1004 1.0986 1.0853 1.0897 1.0948 1.1002 1.0663 1.0774
irintensity: 0.7044 4.8604 6.4458 2.2570 8.1876 1.2116 2.6839 0.2282 2.0470 0.6862 20.2474 2.5911 8.5326 2.3402 40.5402 107.1500 41.1537 2.3416 7.5594 2.6136 13.4341 29.4626 1.3441 2.7196 143.1205 16.5052 7.1564 26.5389 18.7451 3.9312 91.9877 5.1203 14.0258 56.2584 69.3090 80.6423 117.2501 7.9004 13.3232 0.8756 0.0824 10.2248 46.2328 2.1839 82.9687 135.0128 261.2091 17.6269 37.6334 69.0964 4.7639 326.4786 64.7068 10.0104 7.8865 1.8711 3.3270 13.4615 30.3912 24.1381 25.5880 16.9214 8.0756 3.4648 3.0887 254.1504 183.8356 23.9964 20.5740 2.5401 32.5153 260.1527 45.5092 20.3634 20.3889 82.7590 13.7571 39.9153 23.0087 14.6563 3.4385 2.4159 13.8880 21.5934 13.3679 5.9472 32.2704
temp: 298.150 k
press: 1.00000 atm
elementType: 8 8 8 8 7 6 6 6 6 6 6 6 6 6 6 6 1 1 1 1 1 1 1 1 1 1 1 1 1 1 1
symmnumber: 1
zpe: 649140.2 jmol-1
zpe.correction: 0.247244 hartree
zpe.thermalcorrener: 0.263885 hartree
zpe.thermalcorrenthalpy: 0.264829 hartree
zpe.thermalcorrgfe: 0.202768 hartree
zpe.sumelectzpe: -782.591491 hartree
zpe.sumelectthermal: -782.574850 hartree
zpe.sumelectthermalent: -782.573906 hartree
zpe.sumelectthermalfe: -782.635967 hartree
dipole: 0.6726 0.1249 -2.6909
dipole: 2.7765
quadrupole: -81.8815 -82.2297 -98.0774
quadrupole: -8.3194 -10.1241 1.9750
quadrupole: 5.5147 5.1665 -10.6812 -8.3194 -10.1241 1.9750
hfenergy: -782.8387353 hartree
pointgroup: C01 [X(C11H15N1O4)]
dipole: 0.1843137 -0.1600011 1.0647424 debye
polarizability: 161.7384812|-20.9800755|166.8905041|8.8856232|-5.703905|93.1730659 unknown
InChI: InChI=1S/C11H15NO4/c1-8(2)15-9-5-3-4-6-10(9)16-11(14)12-7-13/h3-6,8,12-13H,7H2,1-2H3
charge 0 multiplicity 1
31 atoms
O  -0.749142 -0.811921 0.749561
O  0.934771 1.318373 0.579855
O  1.247845 -0.019827 -1.364381
O  3.221776 -2.419412 0.335716
N  2.771433 -0.006513 0.431531
C  -1.405892 -2.095894 0.344089
C  -1.341539 0.407199 0.419345
C  -1.487749 -2.19921 -1.187643
C  -0.523743 -3.178836 0.973208
C  -0.453196 1.516699 0.335754
C  -2.724985 0.629322 0.220901
C  -0.926524 2.815972 0.099723
C  -3.203682 1.937223 -0.023132
C  -2.313621 3.032983 -0.076483
C  1.615492 0.360022 -0.236377
C  3.63265 -1.065188 -0.066839
H  -2.419824 -2.122271 0.797146
H  -1.922137 -3.175148 -1.472302
H  -2.115891 -1.402544 -1.62174
H  -0.477809 -2.113087 -1.62268
H  -0.943681 -4.178808 0.762324
H  -0.46674 -3.045163 2.067655
H  0.497072 -3.125461 0.554412
H  -3.42924 -0.206975 0.272223
H  -0.206262 3.63826 0.047792
H  -4.277785 2.095838 -0.168741
H  -2.688294 4.044271 -0.263176
H  2.900467 0.379256 1.368324
H  4.670018 -0.857236 0.260071
H  3.568852 -1.083856 -1.163807
H  3.294658 -2.512166 1.320175
