program: Gaussian 09
title: 000197970
version: EM64L-G09RevD.01
frameworkgroup: C1[X(C22H35NO)]
method: RPBEPBE
basis: SDD
operation: Freq
keyword: #p
keyword: freq=noraman
keyword: PBEPBE/SDD
title: #p freq=noraman PBEPBE/SDD
converged: YES YES NO NO
title: Mulliken charges:
elementType: O N C C C C C C C C C C C C C C C C C C C C C C H H H H H H H H H H H H H H H H H H H H H H H H H H H H H H H H H H H
charge: -0.227852 -0.073477 -0.366351 -0.345143 -0.392830 -0.399918 -0.397689 -0.356166 -0.540518 -0.364922 -0.384575 -0.389727 -0.372411 0.107211 -0.575106 -0.352856 0.279700 0.508865 -0.356683 -0.347697 -0.358122 -0.428438 -0.419206 -0.695988 0.167389 0.214904 0.200541 0.168780 0.191567 0.203512 0.203259 0.190273 0.189159 0.212648 0.233272 0.192765 0.233601 0.251748 0.192438 0.195190 0.193447 0.195610 0.211146 0.213823 0.190615 0.189618 0.209591 0.211235 0.187931 0.188773 0.194793 0.195119 0.245132 0.274390 0.235143 0.237058 0.210064 0.215622 0.209744
chargesum: 0.00000
title: Mulliken charges with hydrogens summed into heavy atoms:
elementType: O N C C C C C C C C C C C C C C C C C C C C C C
charge: -0.227852 -0.073477 0.015943 0.024179 0.002250 -0.006386 0.004117 0.069870 -0.055169 0.022707 0.004481 0.035242 0.007822 0.107211 -0.154280 0.023848 0.279700 0.508865 0.033229 -0.102566 -0.083732 -0.193295 -0.182148 -0.060559
polarizability: 3.60111766e+02 -4.83604636e+00 2.18477161e+02 1.56681944e+01 1.90667894e+01 1.92336069e+02
1716.lowfreq: -3.8992 -1.1960 -0.0008 0.0010 0.0022 3.8516 10.0534 17.9443 24.1443
frequency: 9.1130 17.7433 24.0964 30.9842 36.0008 46.8684 50.9037 66.6248 68.1849 91.0294 93.3572 98.7687 125.6575 134.8011 144.4500 145.9868 152.2875 197.9752 200.8551 231.4990 235.8643 243.9396 278.9208 298.7400 301.5544 332.6306 359.1613 379.4324 399.8444 402.9727 436.8927 442.1200 451.9457 460.1073 491.4426 516.3211 545.9227 579.2422 622.6729 633.7475 721.7116 725.9956 728.0792 743.4871 747.5021 788.3868 789.1183 790.3810 805.2706 824.4624 846.3367 853.1282 855.1960 856.4270 867.4554 888.6480 909.7682 930.5101 957.8667 967.9452 973.8136 983.7802 999.0779 999.5445 1003.1564 1010.6830 1015.3269 1030.9177 1039.3422 1049.2194 1056.9804 1068.8037 1074.5661 1077.9539 1080.7617 1094.4390 1108.2886 1118.3858 1122.7797 1128.5511 1151.4767 1154.9192 1169.0044 1186.0892 1189.2012 1207.2206 1212.1738 1220.2820 1221.6075 1241.5172 1254.3725 1256.9183 1258.3335 1264.8158 1278.3955 1281.4300 1282.7817 1291.4657 1292.3063 1295.9800 1296.4346 1303.9803 1315.1818 1320.5834 1329.5419 1339.5041 1339.9458 1344.4191 1349.1766 1351.5261 1351.8408 1366.9683 1383.0368 1388.5147 1393.2275 1412.4251 1434.2669 1453.3108 1460.1644 1460.3998 1461.1620 1461.7772 1464.5574 1464.8261 1468.0586 1468.8210 1474.5000 1478.3614 1479.1734 1481.0938 1486.8897 1489.4779 1500.2293 1559.1540 1592.0111 1619.8939 2814.3368 2826.1092 2873.9985 2949.7822 2950.8318 2953.2393 2960.0668 2966.3963 2967.5485 2969.9006 2971.8072 2973.6773 2980.6092 2983.9730 2984.0648 2984.8797 2990.8985 3002.2399 3015.2977 3022.6803 3024.5615 3025.7344 3029.5779 3035.5177 3037.8544 3044.6439 3050.7362 3051.9869 3053.6046 3068.5232 3071.2366 3120.1089 3123.0514 3150.3197 3157.0772
redmass: 4.1793 3.5922 3.7241 3.7304 3.8828 1.6369 3.3175 4.1244 4.5191 2.6545 1.9808 2.1058 4.2601 2.4930 2.1540 2.0182 3.5368 3.7929 3.2891 4.2672 1.8996 1.0994 3.6256 2.4080 2.8323 3.6599 2.9711 2.0177 3.0212 2.8416 3.2502 3.4483 3.0068 2.9726 3.6598 3.3390 1.9034 2.2304 4.3669 6.8527 1.0608 3.7867 1.0785 3.0381 1.1417 1.7953 1.2026 2.5561 1.5534 3.7824 1.4439 1.4423 1.3900 2.2230 1.4290 1.8907 2.3637 1.2380 1.3112 1.5239 3.2687 3.7219 1.4496 2.3288 1.2535 3.8842 2.7372 1.9364 3.1498 2.1659 2.9973 1.6748 1.3679 2.3088 2.2140 1.9922 2.1795 2.5671 2.5006 1.2913 1.2835 2.4801 1.2585 1.7651 1.1949 1.8263 1.2810 1.5798 2.0154 2.1023 1.3380 1.3092 1.2621 1.1753 1.0623 1.1341 1.2284 1.3081 1.1277 1.3160 1.1450 1.7574 1.4126 1.3979 1.2958 1.4304 1.4709 1.5182 1.4855 1.5998 1.6704 1.4215 4.7990 1.2163 1.4850 3.2441 1.1038 1.0894 1.0867 1.0747 1.0716 1.0881 1.0679 1.0844 1.0866 1.0881 1.0846 1.0425 1.0971 1.0852 1.0906 1.0960 2.5726 7.0255 7.8189 6.5190 1.0714 1.0702 1.0710 1.0587 1.0587 1.0592 1.0591 1.0623 1.0588 1.0588 1.0365 1.0599 1.0591 1.0622 1.0965 1.0603 1.0987 1.1012 1.1026 1.0947 1.0876 1.1040 1.0904 1.0922 1.1047 1.1033 1.1047 1.0911 1.1034 1.1007 1.0993 1.0883 1.0891 1.0944 1.0954
irintensity: 0.0988 0.0899 1.1998 0.1615 0.2939 0.0117 0.2592 1.0188 0.4423 2.5681 0.0190 0.2154 0.3014 0.1058 0.0049 0.0430 0.3957 0.3082 6.9440 0.5099 0.5613 0.0011 4.6847 1.7814 0.9700 0.6720 5.2319 1.5541 2.6092 0.1343 1.1077 0.4869 0.6654 2.7864 7.9037 8.6079 4.6644 12.7400 8.1158 0.2639 14.1813 4.6260 0.0186 1.0754 2.8605 31.5653 0.9646 5.8351 2.5723 2.4062 9.4804 2.8631 5.0267 7.4929 20.1056 5.5377 6.5490 1.3805 6.9810 5.8777 77.6187 1.3842 1.0693 1.2486 0.9300 0.2807 2.5394 7.5355 0.6223 8.9250 0.5542 4.2465 2.0009 0.4171 0.3118 1.3761 45.0571 28.3895 4.4048 7.8146 6.3900 33.3766 5.4199 2.0318 59.9922 25.2791 15.2933 0.1479 0.6494 93.4325 0.5485 0.0269 9.0311 5.3964 0.2097 0.6608 5.5524 0.9449 0.2115 9.2928 1.7169 93.9780 39.5367 3.6791 16.0539 0.6281 0.2366 41.6661 9.7789 0.2580 1.0637 18.8388 11.6077 11.1713 9.4118 24.7725 12.2930 7.6686 13.3091 0.0364 0.1051 5.1820 0.9822 4.3700 0.1143 7.4272 1.9257 12.3734 10.2140 0.4373 1.9121 33.1744 0.5261 100.9801 108.9031 50.8894 53.6830 133.2071 98.4566 1.1177 2.7368 0.1939 29.5962 40.0098 84.9535 50.2572 39.8487 34.4404 86.4662 28.8381 0.5285 38.7540 0.5515 0.7642 0.0553 11.7587 60.0718 1.1590 86.7512 20.7316 70.5322 19.6579 116.8543 29.2894 105.6858 95.9342 56.6487 12.9034 20.1478 18.3239 3.1514
temp: 298.150 k
press: 1.00000 atm
elementType: 8 7 6 6 6 6 6 6 6 6 6 6 6 6 6 6 6 6 6 6 6 6 6 6 1 1 1 1 1 1 1 1 1 1 1 1 1 1 1 1 1 1 1 1 1 1 1 1 1 1 1 1 1 1 1 1 1 1 1
symmnumber: 1
zpe: 1371257.2 jmol-1
zpe.correction: 0.522284 hartree
zpe.thermalcorrener: 0.548761 hartree
zpe.thermalcorrenthalpy: 0.549706 hartree
zpe.thermalcorrgfe: 0.460200 hartree
zpe.sumelectzpe: -987.435108 hartree
zpe.sumelectthermal: -987.408631 hartree
zpe.sumelectthermalent: -987.407687 hartree
zpe.sumelectthermalfe: -987.497192 hartree
dipole: 2.4214 2.2540 1.4072
dipole: 3.5950
quadrupole: -141.1651 -151.8450 -151.5625
quadrupole: -13.1275 -0.5281 -1.3093
quadrupole: 7.0258 -3.6541 -3.3716 -13.1275 -0.5281 -1.3093
hfenergy: -987.9573925 hartree
pointgroup: C01 [X(C22H35N1O1)]
dipole: 0.9532678 -0.9005639 -0.5298388 debye
polarizability: 360.0917952|4.5451033|219.4958863|-15.8729462|18.3170921|191.3373138 unknown
InChI: InChI=1S/C22H35NO/c1-2-3-4-5-6-8-11-20-12-14-21(15-13-20)22(24)16-19-23-17-9-7-10-18-23/h12-15H,2-11,16-19H2,1H3
charge 0 multiplicity 1
59 atoms
O  -3.061137 2.34126 1.327003
N  -5.93923 -0.546314 0.060653
C  -7.348496 -0.194754 0.381649
C  -5.656579 -1.96561 0.400564
C  -8.337775 -1.092261 -0.388602
C  -6.591292 -2.923099 -0.36655
C  -8.072517 -2.584889 -0.086119
C  -4.985796 0.397113 0.698867
C  -3.587543 0.324228 0.060721
C  5.316405 0.51741 -0.732126
C  6.173033 -0.424879 0.143592
C  3.830814 0.549033 -0.311036
C  7.658087 -0.473477 -0.281718
C  -2.649833 1.434402 0.541059
C  2.971137 1.49252 -1.20124
C  8.513485 -1.418369 0.592295
C  -1.226573 1.428894 0.059736
C  1.508209 1.497043 -0.792087
C  9.997859 -1.47253 0.16407
C  -0.731418 0.472475 -0.86806
C  -0.336681 2.423623 0.549135
C  0.613693 0.510714 -1.285564
C  1.005954 2.454415 0.130721
C  10.844732 -2.418481 1.042823
H  -7.548186 -0.292292 1.482837
H  -7.508095 0.866011 0.112143
H  -4.605471 -2.193264 0.145919
H  -5.774522 -2.140856 1.504597
H  -9.374364 -0.815241 -0.115529
H  -8.21454 -0.906957 -1.473345
H  -6.38839 -2.824566 -1.45066
H  -6.366351 -3.967492 -0.075462
H  -8.300729 -2.789747 0.980675
H  -8.74009 -3.229172 -0.689207
H  -5.373375 1.42335 0.569611
H  -4.903234 0.231959 1.802347
H  -3.105049 -0.652943 0.258882
H  -3.699516 0.390678 -1.041048
H  5.390672 0.200027 -1.793603
H  5.735052 1.544625 -0.685406
H  5.747446 -1.449434 0.103342
H  6.105374 -0.102893 1.203722
H  3.408768 -0.47528 -0.357197
H  3.747211 0.872385 0.746097
H  8.085493 0.550427 -0.240655
H  7.725264 -0.795221 -1.342278
H  3.071089 1.16748 -2.255711
H  3.388229 2.516503 -1.138355
H  8.085163 -2.442081 0.554397
H  8.450896 -1.095637 1.652781
H  10.05956 -1.795751 -0.895318
H  10.425051 -0.449469 0.201427
H  -1.394349 -0.299218 -1.273678
H  -0.731139 3.160865 1.256714
H  0.979214 -0.230512 -2.006955
H  1.678958 3.229447 0.517657
H  10.823366 -2.100066 2.102298
H  11.901156 -2.438336 0.717291
H  10.457399 -3.453999 0.997286
