program: Gaussian 09
title: 000197831
version: EM64L-G09RevD.01
frameworkgroup: C1[X(C7H14N6)]
method: RPBEPBE
basis: SDD
operation: Freq
keyword: #pfreq=noraman
keyword: PBEPBE/SDD
title: #p freq=noraman PBEPBE/SDD
converged: YES YES NO NO
title: Mulliken charges:
elementType: N N N N N N C C C C C C C H H H H H H H H H H H H H H
charge: -0.348321 -0.140138 -0.153390 -0.148683 -0.592663 -0.594141 -0.411938 -0.315780 -0.339696 -0.689216 0.105308 0.065981 0.051637 0.198127 0.204284 0.219752 0.225521 0.197759 0.198167 0.320453 0.209856 0.218177 0.210428 0.326783 0.327916 0.326439 0.327379
chargesum: 0.00000
title: Mulliken charges with hydrogens summed into heavy atoms:
elementType: N N N N N N C C C C C C C
charge: -0.027868 -0.140138 -0.153390 -0.148683 0.062036 0.059677 -0.009526 0.129493 0.056229 -0.050757 0.105308 0.065981 0.051637
polarizability: 1.73627824e+02 1.77776792e+00 1.32418971e+02 -1.03832353e+00 4.59558915e-02 6.90022534e+01
1716.lowfreq: -14.2785 0.0004 0.0008 0.0009 6.5235 12.2809 15.1312 55.9443 67.2027
frequency: -10.4591 55.8197 67.1647 100.8545 124.6806 179.7738 182.4641 188.7512 222.9162 233.7449 252.0855 320.6234 364.1157 434.1350 440.0244 454.3799 510.1843 532.7705 537.1714 540.8708 555.1318 592.4247 703.7083 707.8127 709.1801 734.7727 791.8243 794.6936 894.4583 897.7237 927.4174 937.0492 989.4925 1034.9203 1072.1258 1081.8154 1121.5428 1135.5636 1153.9765 1166.4568 1219.5497 1254.7430 1273.0047 1279.0913 1292.2811 1328.1716 1360.1995 1373.8596 1391.0972 1439.1409 1468.4538 1471.2208 1474.5075 1477.6651 1485.7061 1496.9030 1518.6899 1521.1606 1554.6389 1592.3948 1631.8404 2959.2522 2970.2700 2974.3286 2977.0433 3000.0368 3018.4017 3040.7650 3071.3088 3074.8079 3559.6163 3561.4977 3569.8583 3721.8636 3722.7663
redmass: 2.4137 2.3250 3.8313 2.1375 2.8748 3.4718 6.4841 6.0084 1.9303 1.7888 4.1888 2.8824 2.9888 2.8890 1.1926 1.2237 1.1269 3.9373 1.0488 1.0407 7.7885 5.9683 5.5020 9.7320 10.2244 1.0759 1.5455 3.2622 6.2719 2.3270 2.0856 1.1745 3.4418 3.0994 2.6037 2.3348 2.3575 3.1046 1.6021 2.8327 1.2904 2.6527 1.1714 1.7197 1.0776 1.5668 1.7062 1.9217 1.2211 3.8887 1.2748 1.7199 1.1316 1.0424 1.0774 1.1229 3.1432 3.9483 2.6627 1.4281 2.5171 1.0589 1.0595 1.0365 1.0607 1.0978 1.1021 1.1046 1.1010 1.0993 1.0438 1.0444 1.0767 1.1059 1.1058
irintensity: 0.0431 1.1647 0.2063 0.0111 5.8491 0.5796 0.5488 13.1859 2.7731 0.7167 1.4448 9.9545 3.3161 2.8079 13.0041 550.4309 141.2492 4.6141 0.9405 0.0039 4.7791 1.6889 1.0185 0.1749 0.2687 8.6060 8.0196 41.1692 0.3206 4.8089 10.5117 0.4693 3.9885 2.6803 0.8915 0.8136 0.7562 9.2057 1.2923 6.4896 0.7721 1.3326 1.3160 0.2244 0.1503 20.2937 15.9619 20.4243 5.3504 44.8181 30.7025 44.9845 6.1902 13.0398 26.9995 120.3588 467.0125 599.1977 926.3669 626.2694 44.4774 8.4338 16.9623 38.5854 78.3823 1.8108 0.7082 59.7383 90.5524 50.4507 116.5921 68.7208 42.9716 37.8100 49.7601
temp: 298.150 k
press: 1.00000 atm
elementType: 7 7 7 7 7 7 6 6 6 6 6 6 6 1 1 1 1 1 1 1 1 1 1 1 1 1 1
symmnumber: 1
zpe: 591378.4 jmol-1
zpe.correction: 0.225244 hartree
zpe.thermalcorrener: 0.238274 hartree
zpe.thermalcorrenthalpy: 0.239219 hartree
zpe.thermalcorrgfe: 0.185753 hartree
zpe.sumelectzpe: -602.696887 hartree
zpe.sumelectthermal: -602.683856 hartree
zpe.sumelectthermalent: -602.682912 hartree
zpe.sumelectthermalfe: -602.736377 hartree
dipole: 0.7003 0.1365 -0.0026
dipole: 0.7135
quadrupole: -64.3457 -65.1894 -81.4253
quadrupole: 0.5060 -0.3374 0.1661
quadrupole: 5.9744 5.1307 -11.1051 0.5060 -0.3374 0.1661
hfenergy: -602.9221308 hartree
pointgroup: C01 [X(C7H14N6)]
dipole: 0.2756807 0.0528979 -0.0002183 debye
polarizability: 173.6409114|1.6616236|132.4044087|-0.8690951|0.5276175|69.0037284 unknown
InChI: InChI=1S/C7H14N6/c1-2-3-4-10-7-12-5(8)11-6(9)13-7/h10H,2-4,8-9H2,1H3
charge 0 multiplicity 1
27 atoms
N  0.856424 -0.695906 -0.043559
N  -0.763592 1.008028 -0.007329
N  -1.381454 -1.362461 -0.022931
N  -3.123847 0.354451 0.021352
N  -2.475584 2.602824 0.038428
N  -3.654343 -1.925535 0.00412
C  3.320377 -0.476743 0.019338
C  1.970756 0.262502 -0.060247
C  4.521322 0.495044 -0.005064
C  5.879964 -0.233452 0.071812
C  -0.4643 -0.332507 -0.025245
C  -2.110271 1.278527 0.016532
C  -2.686535 -0.949817 -0.000069
H  3.406808 -1.185113 -0.831137
H  3.356179 -1.082484 0.948186
H  1.924048 0.878446 -0.980956
H  1.863318 0.964387 0.789148
H  4.478645 1.104866 -0.930076
H  4.432655 1.205546 0.841477
H  1.041972 -1.699222 -0.070213
H  6.008176 -0.926569 -0.780865
H  6.721964 0.48226 0.054285
H  5.960489 -0.82697 1.001898
H  -1.75034 3.314472 0.036439
H  -3.462913 2.84225 0.056945
H  -3.372504 -2.901589 -0.008573
H  -4.632012 -1.649534 0.023006
