program: Gaussian 09
title: 000197802
version: EM64L-G09RevD.01
frameworkgroup: C1[X(C8HCl3F3N3O2)]
method: RPBEPBE
basis: SDD
operation: Freq
keyword: #p
keyword: freq=noraman
keyword: PBEPBE/SDD
title: #p freq=noraman PBEPBE/SDD
converged: NO YES NO NO
title: Mulliken charges:
elementType: Cl Cl Cl F F F O O N N N C C C C C C C C H
charge: 0.115211 0.128033 0.075496 -0.109827 -0.148515 -0.148663 -0.247816 -0.152765 -0.390972 0.018049 0.015873 0.123883 0.226859 0.586878 0.125502 -0.401325 -0.392980 -0.086176 0.268042 0.395212
chargesum: 0.00000
title: Mulliken charges with hydrogens summed into heavy atoms:
elementType: Cl Cl Cl F F F O O N N N C C C C C C C C
charge: 0.115211 0.128033 0.075496 -0.109827 -0.148515 -0.148663 -0.247816 -0.152765 0.004241 0.018049 0.015873 0.123883 0.226859 0.586878 0.125502 -0.401325 -0.392980 -0.086176 0.268042
polarizability: 2.24093743e+02 -3.14548434e-01 1.99155089e+02 8.39895684e-03 1.19950742e-03 5.91507423e+01
1716.lowfreq: -22.2621 -8.3743 -5.6005 -0.0013 0.0004 0.0018 2.6049 23.0056 48.4913
frequency: -22.2598 22.8508 48.4870 67.9921 84.7315 91.0730 168.2445 176.8517 187.7068 208.1597 232.9328 243.8634 252.2804 290.1138 304.8001 333.2491 365.2871 367.3390 389.1628 391.4923 455.8489 483.7688 492.6270 545.8217 577.1074 645.8069 658.4716 678.5956 695.6739 716.8080 721.2014 779.0124 796.1281 810.4681 835.7095 922.9450 976.0585 978.9985 994.2513 1041.7810 1086.4372 1157.3850 1195.0244 1230.1052 1264.0881 1307.6419 1358.4685 1371.4840 1416.3702 1420.2230 1503.3400 1562.9166 1611.1167 3512.1510
redmass: 18.4100 17.2698 18.2276 27.6959 17.0615 18.1344 14.3291 22.8669 8.7757 24.5264 15.4950 27.7237 20.8835 14.0296 18.4937 27.4419 15.2729 10.6733 14.5304 13.8074 11.8681 14.3675 14.6897 9.6863 11.0952 12.0522 15.6454 9.5392 13.0127 11.6594 13.8038 1.1809 10.7232 13.4348 11.1286 10.6533 10.0224 11.5239 9.2234 5.4365 4.3274 9.8797 4.3845 5.2460 5.9315 12.0112 10.7493 12.3563 12.0451 8.3459 7.4868 11.7161 10.5916 1.0823
irintensity: 0.1259 0.4319 0.1000 0.1315 1.3254 0.6107 0.0017 0.0512 10.3122 0.8524 8.6410 0.3439 1.3475 0.1218 0.6373 0.4694 1.8371 0.0811 2.8117 0.5978 33.4218 0.8783 1.8000 4.5958 5.2786 10.5067 14.9666 0.8682 0.1734 3.2495 7.0373 77.3428 24.3866 9.1297 0.1818 51.5631 26.6784 277.2815 44.7644 83.4730 215.5709 530.2225 287.7418 142.9022 102.0057 44.5500 41.2075 123.2181 44.8916 49.3579 51.0199 118.9801 27.4623 124.5269
temp: 298.150 k
press: 1.00000 atm
elementType: 17 17 17 9 9 9 8 8 7 7 7 6 6 6 6 6 6 6 6 1
symmnumber: 1
zpe: 239435.3 jmol-1
zpe.correction: 0.091196 hartree
zpe.thermalcorrener: 0.106909 hartree
zpe.thermalcorrenthalpy: 0.107853 hartree
zpe.thermalcorrgfe: 0.045850 hartree
zpe.sumelectzpe: -2298.408318 hartree
zpe.sumelectthermal: -2298.392605 hartree
zpe.sumelectthermalent: -2298.391661 hartree
zpe.sumelectthermalfe: -2298.453664 hartree
dipole: 1.4735 -0.7705 -0.0010
dipole: 1.6628
quadrupole: -136.2152 -140.9746 -125.1760
quadrupole: -7.6804 0.0124 0.0071
quadrupole: -2.0933 -6.8527 8.9459 -7.6804 0.0124 0.0071
hfenergy: -2298.4995138 hartree
pointgroup: C01 [X(C8H1Cl3F3N3O2)]
dipole: -0.5348121 -0.3767287 -0.0000922 debye
dipolederiv: 0.0115462 0.1468329 0.0000924 0.0755103 -0.7564199 -0.0005648 0.0000581 -0.0005103 0.0484086 -0.6013689 0.0907638 -0.0002559 0.1847768 0.0168868 0.0000654 -0.0002079 0.0000072 0.0554949 -0.3683666 -0.3241934 -0.000461 -0.3339574 -0.2337387 -0.0003808 -0.0004516 -0.0004329 0.0228982 -0.648208 0.2247864 -0.002765 0.242575 -0.5533354 0.003894 -0.0015327 0.0037518 -0.2562085 -0.67923 -0.1275898 0.1306657 -0.257026 -0.4237399 0.2344578 0.1981534 0.2051158 -0.6244222 -0.6747223 -0.128311 -0.1280118 -0.2587984 -0.4312055 -0.2382176 -0.1908878 -0.2076279 -0.6173319 -0.681616 -0.3418854 -0.000491 -0.1655935 -0.7360567 -0.000519 -0.0008212 -0.0010287 -0.2532866 -0.5972546 0.3590263 -0.0002124 0.2310008 -0.6898456 -0.0002724 0.0002845 -0.0007131 -0.1833481 -0.5886613 0.1416284 -0.0000142 -0.0965939 -0.475559 -0.0002248 0.0002244 0.0002893 -0.1808475 -0.1177953 -0.0827335 -0.0000144 0.1057619 -0.3167833 0.0001587 0.0003005 -0.0004331 -0.2083491 1.0311899 -0.1420754 0.0006206 -0.0468195 2.0325332 0.0018072 0.0006069 0.0022255 0.2039357 0.1913098 -0.1461364 -0.0001443 0.3801926 0.1668791 0.0002339 0.0004377 0.0000654 0.0546069 0.0121777 -0.0536513 0.0000261 -0.2579735 -0.4034603 -0.0005001 0.0000649 -0.0003665 0.0907054 -0.0621746 -0.0544986 -0.0002243 0.063303 -1.0992595 -0.0012312 -0.000029 -0.0010033 0.1119686 -0.3688887 -0.2194327 -0.0002922 -0.2878603 0.5085239 0.0000817 -0.0036506 -0.0002972 -0.0351927 0.4025376 -0.4605672 -0.0002472 -0.1613189 1.2812223 0.0008726 -0.0000124 0.0007513 -0.0575389 0.7626406 -0.0182289 0.0004711 -0.697962 0.5927035 0.0002248 -0.0001939 0.0006463 -0.0554596 0.146204 0.9564866 0.0009486 1.0737682 -0.1954777 0.000362 0.0009149 0.0004505 -0.0197508 2.4809648 0.1152677 0.0003298 0.2384152 1.3923105 -0.0001843 -0.0031072 -0.0006977 1.5589943 0.3497156 0.0645116 -0.0000204 -0.0314006 0.3238221 -0.0000634 -0.0001511 -0.0001925 0.3447233 unknown
polarizability: 223.580339|3.5549974|199.6683648|0.0657836|0.1213245|59.1508706 unknown
InChI: InChI=1S/C8HCl3F3N3O2/c9-1-2(10)4-5(6(3(1)11)17(18)19)16-7(15-4)8(12,13)14/h16H
charge 0 multiplicity 1
20 atoms
Cl -0.688314 -3.700592 -0.003109
Cl -4.21115 0.575817 -0.001646
Cl -3.692479 -2.522153 -0.003925
F  4.301887 -1.046581 0.012745
F  3.929893 0.880463 -1.13853
F  3.925569 0.901204 1.127764
O  -0.39614 3.049699 0.003544
O  -2.666142 2.968153 0.001722
N  1.15811 0.918742 0.001197
N  1.49136 -1.345257 -0.000068
N  -1.524879 2.390507 0.001134
C  -0.108798 0.356783 0.000126
C  0.117276 -1.060558 -0.000718
C  -1.412554 0.920198 -0.000026
C  2.071278 -0.137076 0.001032
C  -0.984946 -1.943801 -0.001964
C  -2.509801 0.01428 -0.001265
C  -2.288224 -1.399089 -0.002266
C  3.546746 0.120201 0.000882
H  1.314805 1.931862 0.00257
