program: Gaussian 09
title: 000197810
version: EM64L-G09RevD.01
frameworkgroup: C1[X(C20H19NO5)]
method: RPBEPBE
basis: SDD
operation: Freq
keyword: #p
keyword: freq=noraman
keyword: PBEPBE/SDD
title: #p freq=noraman PBEPBE/SDD
converged: NO YES NO NO
title: Mulliken charges:
elementType: O O O O O N C C C C C C C C C C C C C C C C C C C C H H H H H H H H H H H H H H H H H H H
charge: -0.448490 -0.274939 -0.265187 -0.268544 -0.264535 -0.214031 -0.381334 -0.282380 -0.135758 0.487544 0.338845 -0.580279 -0.509150 0.314053 0.172264 -0.537974 -0.454426 -0.630127 0.003727 -0.503203 0.159625 0.156364 0.167742 -0.356541 -0.201650 -0.202631 0.238643 0.247748 0.219831 0.256302 0.213762 0.259603 0.223792 0.266480 0.242606 0.264432 0.201247 0.230149 0.260345 0.390593 0.249608 0.232949 0.238152 0.237911 0.236864
chargesum: 0.00000
title: Mulliken charges with hydrogens summed into heavy atoms:
elementType: O O O O O N C C C C C C C C C C C C C C C C C C C C
charge: -0.057897 -0.274939 -0.265187 -0.268544 -0.264535 -0.214031 -0.142691 -0.034633 0.084073 0.487544 0.338845 -0.110215 -0.025755 0.314053 0.172264 -0.271494 -0.211820 0.065702 0.003727 -0.242858 0.159625 0.156364 0.167742 -0.106933 0.269451 0.272143
polarizability: 3.49554606e+02 1.65113083e+00 2.18136878e+02 -1.75164185e+00 -3.83378922e+00 1.46897146e+02
1716.lowfreq: -65.0348 -10.6413 -2.8724 0.0003 0.0006 0.0007 5.5057 32.6458 44.1098
frequency: -65.0229 32.6254 44.1057 59.4178 70.6814 81.7933 121.0431 142.7975 152.8239 170.7160 186.0179 198.9104 210.1705 240.0349 251.1699 257.9225 284.4919 312.6018 339.0200 353.8609 365.5016 372.4349 398.9027 406.9519 435.5860 452.7694 459.7544 490.6200 508.7649 528.5106 591.7257 606.3245 612.2077 640.3873 659.0456 679.7207 684.1816 703.1502 712.9140 720.0065 728.6547 760.1619 768.8605 787.7935 806.2590 825.8265 837.6598 844.9211 849.3370 854.5854 874.3544 878.2050 898.7754 911.2348 921.1958 926.5245 969.1163 976.3379 980.3050 982.5231 1004.3691 1017.1484 1033.8369 1053.0644 1063.6755 1070.5046 1077.8200 1117.8131 1118.8306 1123.1400 1128.2096 1134.3867 1155.9840 1168.2936 1191.5674 1198.0816 1202.9846 1216.9524 1225.7798 1227.3651 1232.9502 1253.2896 1256.6700 1275.3286 1299.0504 1311.3772 1321.4110 1336.1872 1348.3303 1360.4387 1363.5053 1367.6410 1408.2450 1414.9118 1424.0258 1430.0775 1442.2807 1446.9461 1455.4647 1472.2760 1473.5834 1479.9246 1482.8954 1484.6597 1487.2201 1522.7251 1605.5963 1621.1265 1623.9432 1647.3960 2817.4472 2871.4370 2892.1590 2917.9792 2953.5701 2994.4112 2999.7846 3007.3215 3011.3606 3019.4360 3037.0914 3046.1334 3089.4279 3101.0742 3115.8565 3132.2565 3156.8747 3161.1050 3182.3404
redmass: 2.2764 5.4461 4.2550 5.4538 3.1651 4.3448 5.1789 4.2964 5.0903 4.9669 4.4046 7.3093 4.7326 4.0558 4.2286 1.4531 3.6414 2.8367 4.8980 3.6155 4.0654 4.9750 4.2439 3.8494 3.3073 4.9439 5.4885 3.6394 4.3429 6.0931 5.5349 5.4052 5.6254 6.9891 6.5709 8.9582 7.5800 5.6745 6.3567 5.1043 5.1571 4.2516 5.8184 5.8525 1.5162 5.6400 7.7342 3.7200 4.5257 1.7565 1.6347 3.0119 1.8720 1.4892 2.1119 1.4880 3.5787 5.6071 3.7974 2.5063 2.8793 3.0972 2.3769 2.7944 1.4603 1.4906 2.5188 1.4124 1.0367 1.4879 1.1523 3.0369 1.4778 3.3164 1.9768 1.9233 1.5640 1.2865 1.5787 1.4143 1.7000 2.4275 2.9856 1.6334 1.5819 1.5327 1.4653 1.6355 1.4584 1.5069 1.3228 1.3699 5.0122 3.8171 4.1405 1.2085 1.2649 3.6717 1.1655 1.1290 2.0944 1.2195 1.7711 1.2395 1.3620 1.1426 8.5036 7.9668 9.2928 9.5535 1.0694 1.0713 1.0807 1.0551 1.0668 1.0841 1.0594 1.0862 1.0536 1.0873 1.0930 1.0817 1.1188 1.1119 1.0984 1.0898 1.0924 1.0928 1.0954
irintensity: 14.0443 0.5630 3.1030 1.6122 9.1991 3.1523 1.0111 3.5052 2.8432 0.5643 0.7696 0.1042 0.1749 0.3556 1.9454 0.5919 1.7853 0.9389 1.1781 2.6120 3.6503 0.8949 11.5377 2.8904 10.5357 1.4418 20.4050 0.7119 3.3980 0.4599 1.0633 0.2892 2.5932 2.9462 3.2469 0.0940 0.5531 3.0750 5.7892 2.8515 4.6383 18.1754 6.1221 16.5068 22.1178 36.1864 20.0649 17.0459 10.7153 20.1797 17.6336 9.8726 17.4936 32.5320 51.3740 17.5995 131.1519 137.9554 9.3059 59.1583 30.8905 53.4305 11.6261 55.3689 4.6154 8.9936 22.1893 9.4942 0.0019 7.2202 1.1693 24.7675 25.7350 10.2504 8.6010 30.5381 21.6613 13.4376 6.2947 18.2548 62.4377 99.8591 165.9130 23.6010 40.7493 24.3074 6.8535 6.8589 11.9203 20.0827 3.9170 2.2533 12.5012 4.3807 3.4295 20.1196 18.4251 165.3266 23.0353 8.0818 187.3418 13.9063 15.1618 11.3338 39.7404 92.6081 1.0247 5.0040 0.4534 1.9662 632.1826 9.5479 30.1256 20.6932 23.4362 24.2437 134.5975 42.0290 136.6927 9.6838 11.6646 32.0208 32.5556 32.8085 19.2319 9.7715 5.8206 2.0710 5.9808
temp: 298.150 k
press: 1.00000 atm
elementType: 8 8 8 8 8 7 6 6 6 6 6 6 6 6 6 6 6 6 6 6 6 6 6 6 6 6 1 1 1 1 1 1 1 1 1 1 1 1 1 1 1 1 1 1 1
symmnumber: 1
zpe: 924765.1 jmol-1
zpe.correction: 0.352224 hartree
zpe.thermalcorrener: 0.372475 hartree
zpe.thermalcorrenthalpy: 0.373419 hartree
zpe.thermalcorrgfe: 0.303679 hartree
zpe.sumelectzpe: -1202.468126 hartree
zpe.sumelectthermal: -1202.447876 hartree
zpe.sumelectthermalent: -1202.446932 hartree
zpe.sumelectthermalfe: -1202.516672 hartree
dipole: 1.0736 -2.1961 -1.8791
dipole: 3.0833
quadrupole: -133.1413 -142.6821 -158.4442
quadrupole: 3.3830 -2.7694 -8.2995
quadrupole: 11.6146 2.0738 -13.6883 3.3830 -2.7694 -8.2995
hfenergy: -1202.8203508 hartree
pointgroup: C01 [X(C20H19N1O5)]
dipole: 0.4263995 -0.8697696 -0.730198 debye
polarizability: 349.5523028|1.990074|218.0686499|-1.2758522|-4.4974111|146.967677 unknown
InChI: InChI=1S/C20H19NO5/c1-21-7-13-11(2-3-15-20(13)26-9-23-15)18-14(22)4-10-5-16-17(25-8-24-16)6-12(10)19(18)21/h2-3,5-6,14,18-19,22H,4,7-9H2,1H3
charge 0 multiplicity 1
45 atoms
O  -0.434513 1.267188 2.065063
O  -4.642325 -1.749505 0.301967
O  -6.08081 -0.082203 -0.656237
O  5.158015 -1.661965 -1.010256
O  6.002204 0.374035 -0.045551
N  -0.244873 -1.080491 0.866353
C  -0.469107 1.010219 -0.426448
C  0.324859 -0.321254 -0.330611
C  -0.101656 1.915852 0.800488
C  -1.963963 0.760094 -0.528011
C  1.824346 -0.060914 -0.219619
C  1.396116 2.293133 0.744405
C  -1.627145 -1.550372 0.567629
C  2.323349 1.15649 0.32429
C  -2.500512 -0.459532 -0.01887
C  2.72289 -1.059635 -0.708045
C  -2.817411 1.734738 -1.101304
C  0.580225 -2.201198 1.373663
C  -3.886423 -0.616392 -0.112503
C  3.731351 1.370258 0.425545
C  4.08952 -0.82321 -0.598779
C  -4.729227 0.359816 -0.673067
C  4.585033 0.370606 -0.034601
C  -4.223469 1.555991 -1.187404
C  -6.064249 -1.346204 0.123273
C  6.400479 -0.92894 -0.645371
H  -0.131189 1.543093 -1.337567
H  0.142677 -0.929142 -1.248918
H  -0.708763 2.840623 0.754561
H  1.679257 2.668893 1.744898
H  1.534189 3.137022 0.035107
H  -2.076887 -1.923886 1.506623
H  -1.60028 -2.417673 -0.138036
H  2.344928 -1.983098 -1.156151
H  -2.378092 2.660564 -1.489872
H  1.569717 -1.835232 1.684262
H  0.72129 -3.010358 0.620218
H  0.07669 -2.636792 2.254835
H  4.126221 2.300085 0.845355
H  -0.362294 0.256047 1.875391
H  -4.876994 2.31007 -1.632182
H  -6.511642 -1.163037 1.118357
H  -6.588218 -2.128048 -0.448655
H  6.986897 -0.737512 -1.560232
H  6.956289 -1.515229 0.107108
