program: Gaussian 09
title: 000197764
version: EM64L-G09RevD.01
frameworkgroup: C1[X(C10H23O2PS)]
method: RPBEPBE
basis: SDD
operation: Freq
keyword: #p
keyword: freq=noraman
keyword: PBEPBE/SDD
title: #p freq=noraman PBEPBE/SDD
converged: YES YES NO NO
title: Mulliken charges:
elementType: S P O O C C C C C C C C C C H H H H H H H H H H H H H H H H H H H H H H H
charge: -0.058428 0.938135 -0.518126 -0.628157 -0.629815 -0.293809 -0.706482 -0.353837 -0.238824 -0.324453 -0.348828 -0.633719 -0.686196 -0.682794 0.265850 0.261988 0.210576 0.202962 0.327570 0.255330 0.208913 0.207144 0.214365 0.222383 0.189717 0.212571 0.196542 0.196381 0.242902 0.248406 0.226187 0.216851 0.207208 0.210124 0.211657 0.211915 0.217790
chargesum: 0.00000
title: Mulliken charges with hydrogens summed into heavy atoms:
elementType: S P O O C C C C C C C C C C
charge: -0.058428 0.938135 -0.518126 -0.628157 -0.101977 0.119730 -0.123582 0.062219 0.197925 0.077834 0.044095 0.083776 -0.052012 -0.041432
polarizability: 2.01851365e+02 -1.23943864e+01 1.62554105e+02 2.03944922e+00 -8.56932645e-01 1.34002263e+02
1716.lowfreq: -0.0031 -0.0029 -0.0020 2.1307 7.3358 9.9400 19.8412 20.5916 34.0414
frequency: 18.8994 19.9334 33.6306 45.8405 49.6422 69.4046 80.5554 92.6108 100.6432 110.8413 118.9942 147.2190 160.8879 181.8227 217.7162 231.8860 234.8808 242.3264 255.2957 264.2258 295.9768 307.7060 346.3433 358.7005 444.1639 459.1973 482.7004 589.8866 637.3222 698.3788 739.4547 743.4747 769.1303 806.0614 807.8434 866.7687 899.6282 920.6103 934.4224 950.7395 974.1790 1003.7420 1015.2314 1039.4699 1053.5711 1060.5226 1061.9779 1080.4332 1081.5964 1114.4702 1119.6077 1147.5348 1205.2938 1213.0650 1238.5441 1247.4390 1271.0465 1277.3718 1278.0489 1282.0118 1284.9025 1302.2283 1311.9340 1346.4464 1357.8551 1372.1353 1389.7087 1391.2528 1397.4201 1424.2792 1440.1064 1450.1434 1468.9811 1471.8607 1471.9991 1474.2507 1477.6871 1478.3559 1483.0351 1484.3382 1486.7139 1491.1587 2959.3886 2969.2860 2969.4418 2972.5952 2972.7040 2975.9978 2993.2290 2995.1133 2995.9176 3010.5117 3014.0606 3031.6564 3032.0122 3035.0308 3063.0205 3068.5277 3073.6624 3075.7833 3075.9186 3081.9034 3089.3895 3094.9178 3115.2004
redmass: 3.7199 3.7961 3.5330 1.8888 2.6761 2.8939 2.1630 2.5668 3.1794 2.7367 2.3857 3.5355 5.0158 1.7187 3.0065 1.1855 1.3423 2.3821 1.9983 2.6018 4.5559 3.6681 4.8447 4.0981 3.8006 2.6764 6.8870 4.6028 6.3074 5.1034 1.1478 1.0719 1.3139 1.1330 1.7001 1.3820 1.7917 1.3721 1.1582 7.1419 2.6017 2.6071 2.6436 3.6238 2.1127 1.6288 1.8606 2.2140 1.4910 2.1218 2.5857 1.4564 1.4059 1.3633 1.2629 1.1901 1.2826 1.2633 1.1864 1.1586 1.0936 1.1745 1.2405 1.4433 1.5815 1.3942 1.2140 1.2163 1.1824 1.0795 1.0874 1.0791 1.0761 1.0377 1.0619 1.0639 1.0421 1.0422 1.0693 1.0728 1.0477 1.0904 1.0617 1.0576 1.0605 1.0564 1.0367 1.0377 1.0614 1.0588 1.0356 1.0960 1.1003 1.1029 1.0614 1.1017 1.1051 1.1008 1.0994 1.1000 1.1017 1.1041 1.1009 1.1009 1.1027
irintensity: 0.2173 0.0309 0.1744 1.1753 0.7414 1.2267 1.4384 1.3780 0.4012 0.1349 1.2607 2.6518 6.3691 1.8109 7.9206 1.0052 2.2096 7.7049 7.0961 2.1042 1.2573 0.6849 18.3225 1.5295 8.7205 1.8439 131.2550 11.4247 59.1568 80.2893 12.4551 8.9258 51.7268 0.7516 0.7429 7.4737 20.7069 16.3668 0.9265 193.5450 53.6604 20.4609 5.7665 37.3089 34.9042 15.4530 3.2625 6.1220 1.8441 2.0886 7.4456 2.2879 6.5570 0.2706 3.3045 2.4148 2.7953 0.0623 2.7048 1.3537 0.2866 15.1615 3.3240 0.1663 1.1904 17.7836 11.3636 6.9316 16.1777 8.5878 11.1251 5.4049 0.3987 12.7278 5.3262 0.1728 12.7844 12.7156 7.0489 14.1233 11.9591 18.0489 11.9999 12.7791 44.7509 40.3215 39.8552 34.2148 13.8583 45.7108 27.7612 2.3381 7.7158 0.8659 6.4009 27.9943 8.6688 69.0530 47.3539 60.7018 99.8745 18.2090 10.8236 8.6915 16.8626
temp: 298.150 k
press: 1.00000 atm
elementType: 16 15 8 8 6 6 6 6 6 6 6 6 6 6 1 1 1 1 1 1 1 1 1 1 1 1 1 1 1 1 1 1 1 1 1 1 1
symmnumber: 1
zpe: 833934.6 jmol-1
zpe.correction: 0.317629 hartree
zpe.thermalcorrener: 0.338178 hartree
zpe.thermalcorrenthalpy: 0.339123 hartree
zpe.thermalcorrgfe: 0.264710 hartree
zpe.sumelectzpe: -1283.421039 hartree
zpe.sumelectthermal: -1283.400490 hartree
zpe.sumelectthermalent: -1283.399546 hartree
zpe.sumelectthermalfe: -1283.473959 hartree
dipole: -0.4261 0.0456 -1.2099
dipole: 1.2835
quadrupole: -95.4925 -95.8099 -110.7327
quadrupole: 1.3583 -0.2607 -6.5658
quadrupole: 5.1859 4.8685 -10.0543 1.3583 -0.2607 -6.5658
hfenergy: -1283.7386682 hartree
pointgroup: C01 [X(C10H23O2P1S1)]
dipole: 0.1977634 0.0529082 -0.4616255 debye
polarizability: 205.2646679|-2.8534421|158.966371|2.221645|2.0017798|134.1766946 unknown
InChI: InChI=1S/C6H14O2P.C4H9S/c1-3-5-6-8-9(7)4-2;1-2-3-4-5/h3-6H2,1-2H3;2-4H2,1H3
charge 0 multiplicity 1
37 atoms
S  -1.284564 0.751227 -0.969506
P  0.201229 -0.715538 0.041157
O  1.768623 -0.026207 -0.274876
O  -0.178996 -0.951783 1.582007
C  0.332951 -2.2342 -1.044489
C  -3.790482 0.199717 0.330871
C  -2.458571 0.93548 0.531712
C  3.542437 1.609943 -0.079361
C  2.146401 1.232747 0.419433
C  -4.651952 0.74757 -0.828263
C  4.053868 2.917142 0.572243
C  1.382973 -3.231148 -0.515282
C  -5.991391 -0.005045 -0.978674
C  5.464886 3.304021 0.079083
H  0.575402 -1.871216 -2.057622
H  -0.679156 -2.674451 -1.06851
H  -3.592424 -0.879311 0.17719
H  -4.363038 0.282171 1.279639
H  -1.897454 0.533149 1.3966
H  -2.597215 2.02364 0.652906
H  3.513668 1.723056 -1.180038
H  4.240422 0.780334 0.143956
H  1.401362 2.015395 0.170175
H  2.139482 1.061459 1.513299
H  -4.846755 1.82644 -0.658037
H  -4.074538 0.676716 -1.771685
H  3.345942 3.741665 0.351871
H  4.066779 2.800793 1.674947
H  1.141554 -3.556823 0.511448
H  2.389227 -2.779735 -0.508352
H  1.405914 -4.125024 -1.164069
H  -6.592895 0.4039 -1.811027
H  -6.596822 0.070072 -0.05541
H  -5.821043 -1.079374 -1.180837
H  6.198564 2.510502 0.314921
H  5.473974 3.454862 -1.016651
H  5.814135 4.239555 0.55273
