program: Gaussian 09
title: 000198023
version: EM64L-G09RevD.01
frameworkgroup: C1[X(C22H26Cl2O4)]
method: RPBEPBE
basis: SDD
operation: Freq
keyword: #p
keyword: freq=noraman
keyword: PBEPBE/SDD
title: #p freq=noraman PBEPBE/SDD
converged: NO YES NO NO
title: Mulliken charges:
elementType: Cl Cl O O O O C C C C C C C C C C C C C C C C C C C C C C H H H H H H H H H H H H H H H H H H H H H H H H H H
charge: -0.087516 -0.051049 -0.301103 -0.193687 -0.222044 -0.228178 0.295083 -0.105707 -0.196944 0.230355 -0.105189 -0.512158 -0.564274 -0.506473 -0.506803 -0.200473 -0.806601 -0.179101 0.139377 0.561769 -0.467105 -0.381219 -0.541288 -0.534456 -0.789612 0.166413 0.278892 -0.763326 0.255069 0.260061 0.241332 0.250928 0.246818 0.216692 0.248328 0.304727 0.282817 0.245421 0.277580 0.231792 0.243669 0.253284 0.258269 0.215421 0.240826 0.250930 0.234464 0.281456 0.249300 0.256890 0.274854 0.246254 0.251752 0.253483
chargesum: 0.00000
title: Mulliken charges with hydrogens summed into heavy atoms:
elementType: Cl Cl O O O O C C C C C C C C C C C C C C C C C C C C C C
charge: -0.087516 -0.051049 -0.301103 -0.193687 -0.222044 -0.228178 0.295083 0.149363 0.063116 0.230355 0.136143 -0.014412 -0.099254 -0.201747 0.021436 0.077107 -0.077856 0.079167 0.139377 0.561769 -0.010858 -0.381219 -0.055894 -0.253000 -0.008567 0.166413 0.278892 -0.011837
polarizability: 3.56315418e+02 3.69431265e+00 2.42996257e+02 -3.14872614e+01 -5.76226603e+00 2.14712455e+02
1716.lowfreq: -6.5719 -0.0012 -0.0005 0.0012 3.2041 8.6879 23.6647 35.4800 52.6501
frequency: 23.6134 35.3893 52.6363 59.4833 68.0314 77.6220 85.7429 88.2955 108.6993 117.9604 125.5449 131.5375 142.6140 147.3799 154.4014 175.6416 185.1343 191.4855 203.5317 218.6907 252.3198 262.5755 272.8462 277.5878 306.6734 319.7201 336.5496 344.6917 349.5153 355.2678 389.6023 404.2706 412.7800 427.1681 455.7982 464.6519 477.4336 480.3092 517.2978 523.5631 531.4574 555.9582 563.6764 576.6530 587.1145 597.0071 619.0686 633.1639 648.1215 670.6611 689.5884 750.5030 756.3578 768.3161 801.4068 809.0779 841.7725 848.8344 858.1887 880.6680 892.7191 908.4224 921.9583 927.6597 935.5465 953.9313 959.5158 981.1536 990.3854 994.2406 1000.3580 1011.5119 1030.0430 1033.5295 1039.2724 1044.5330 1061.4167 1078.5667 1083.1683 1091.4048 1104.9528 1124.8953 1140.4598 1143.9732 1150.1656 1158.8008 1183.3223 1190.5145 1199.6790 1204.6176 1214.2334 1218.0307 1222.3907 1239.2829 1242.5969 1255.3470 1270.8471 1272.3025 1275.1516 1282.9965 1289.9489 1299.9946 1303.6689 1318.8437 1322.8893 1330.3158 1333.9309 1343.2866 1347.8157 1358.0940 1370.9573 1376.1070 1383.7032 1411.0653 1439.9973 1448.1177 1451.4171 1452.4007 1454.9530 1461.6140 1468.4098 1470.8539 1478.4802 1486.6138 1496.8151 1572.1502 1598.8727 1616.1369 1621.5379 1643.3566 2921.0365 2944.4954 2951.9284 2966.4687 2972.5205 2978.3548 2983.1032 2995.7600 3003.9149 3004.8513 3008.1720 3040.0797 3050.5471 3050.8907 3062.0735 3068.0844 3071.1354 3086.9298 3093.0427 3095.1156 3101.3900 3119.5386 3120.4846 3141.2632 3146.8480 3152.5673
redmass: 8.3038 6.2360 1.5891 2.3199 3.7236 4.8924 5.2981 3.9423 3.9034 3.7424 2.9501 6.1934 4.0520 2.2692 2.9821 7.9460 3.3947 6.8603 4.0701 3.1823 1.9290 3.2729 1.6472 3.3425 3.5228 3.2302 4.6688 3.8831 4.8491 3.6097 3.9459 2.7846 4.1180 2.8421 3.9787 4.1593 4.4201 3.3766 4.3277 4.3681 4.2734 3.2942 3.3861 3.4904 3.5501 3.6841 3.7862 3.3699 4.0282 4.8976 3.0456 2.7671 3.3675 3.0174 4.1587 2.2229 1.8841 2.2486 2.0586 2.4881 2.6547 2.4049 1.4695 3.0831 2.4818 2.6498 2.4152 2.3529 2.3945 1.8914 2.1484 2.0033 2.0861 2.0586 1.6774 2.7022 3.0252 1.8580 2.5126 2.1317 2.2557 1.5636 2.0871 2.9599 1.9657 1.8484 1.8758 1.6084 1.7912 1.7148 2.1741 1.3535 1.6982 1.7840 1.5773 1.4421 1.7560 1.4359 1.3827 1.6129 1.4448 1.8029 1.4605 1.3932 1.4090 1.4033 1.6252 1.5005 2.3199 1.5673 1.2104 1.3196 1.2347 1.1744 1.0812 1.0755 1.0602 1.0697 1.0516 1.0684 1.0634 1.0873 1.0728 1.0578 1.0783 10.3232 7.4340 9.5169 9.3935 9.5493 1.0787 1.0798 1.0810 1.0830 1.0684 1.0619 1.0607 1.0364 1.0596 1.0380 1.0398 1.0623 1.0993 1.0988 1.1025 1.0950 1.0874 1.0948 1.0964 1.0955 1.1026 1.0992 1.1018 1.1014 1.0914 1.0910
irintensity: 2.4832 0.7093 2.3673 1.1917 1.1241 1.2731 3.0781 0.1895 2.8168 0.3900 1.4807 0.5841 3.8035 1.5498 0.9638 2.2371 1.7299 0.8203 3.3288 0.1014 1.0882 10.8972 0.9053 4.1243 2.6732 3.0009 5.3533 3.0650 5.6676 7.8493 4.2498 2.3132 6.9362 0.1584 5.4477 2.6852 3.4956 9.9285 16.7121 0.8484 5.3153 5.3836 3.6922 6.3819 14.6623 4.5880 6.0351 4.5408 1.8365 0.5642 4.9033 4.6321 3.1171 5.4187 52.8601 7.1322 12.7446 4.6439 9.2707 1.8728 4.8939 61.6148 75.3753 48.1438 1.4616 12.9636 9.8926 9.3532 6.2979 40.7395 1.7716 6.5910 4.5540 4.3482 7.6263 15.6032 11.4629 16.1454 0.5577 31.3346 12.4703 49.5827 25.1447 3.7014 0.0598 25.6948 10.4244 38.6986 92.8224 87.9080 144.5525 36.0104 27.2328 18.5915 27.1924 8.5327 72.3138 10.3945 8.1696 3.3736 2.1610 30.6180 0.7243 1.6075 4.1045 4.7365 6.2899 8.2657 9.5809 2.8339 68.3480 4.6000 47.8466 31.2914 15.2678 5.9195 13.0336 23.8028 21.6304 17.4631 13.5465 5.3588 15.0884 5.8563 10.7883 127.9247 236.3779 17.3823 81.4072 180.0507 3.6144 1.7300 4.9392 16.5125 5.2398 40.7391 12.4133 2.0115 31.3785 1.6861 13.3853 8.7948 9.7313 23.7634 23.1658 18.5632 12.9288 4.1055 18.8143 7.0403 12.3321 13.1952 14.3846 8.7808 4.7819 0.6423
temp: 298.150 k
press: 1.00000 atm
elementType: 17 17 8 8 8 8 6 6 6 6 6 6 6 6 6 6 6 6 6 6 6 6 6 6 6 6 6 6 1 1 1 1 1 1 1 1 1 1 1 1 1 1 1 1 1 1 1 1 1 1 1 1 1 1
symmnumber: 1
zpe: 1137220.9 jmol-1
zpe.correction: 0.433145 hartree
zpe.thermalcorrener: 0.460517 hartree
zpe.thermalcorrenthalpy: 0.461461 hartree
zpe.thermalcorrgfe: 0.375833 hartree
zpe.sumelectzpe: -2072.859693 hartree
zpe.sumelectthermal: -2072.832321 hartree
zpe.sumelectthermalent: -2072.831377 hartree
zpe.sumelectthermalfe: -2072.917004 hartree
dipole: 3.5618 -0.7771 2.6728
dipole: 4.5204
quadrupole: -249.2219 -180.4128 -174.1598
quadrupole: 2.5785 23.4732 -3.7295
quadrupole: -47.9571 20.8520 27.1051 2.5785 23.4732 -3.7295
hfenergy: -2073.2928378 hartree
pointgroup: C01 [X(C22H26Cl2O4)]
dipole: -1.3784727 0.4803275 1.015864 debye
polarizability: 356.2629325|-1.3426622|243.4068563|32.0979051|1.3747758|214.3543407 unknown
InChI: InChI=1S/C22H26Cl2O4/c1-11(25)22(28-12(2)26)7-6-17-16-9-18(23)15-8-13(27)4-5-14(15)20(16)19(24)10-21(17,22)3/h8-9,14,16-17,19-20H,4-7,10H2,1-3H3
charge 0 multiplicity 1
54 atoms
Cl 0.962146 2.932273 -1.339918
Cl 3.572706 -3.517493 -0.640538
O  -2.972417 -0.212777 1.198533
O  -4.818168 0.870366 -1.735446
O  6.760472 0.080511 1.43324
O  -5.180473 -0.963933 1.300324
C  -1.640067 0.586344 -0.703272
C  -0.804017 -0.736529 -0.629808
C  0.681043 -0.49954 -0.989836
C  -3.062887 0.005067 -0.293042
C  1.287751 0.468529 0.065858
C  -1.029368 1.631052 0.266071
C  -1.65902 -1.75222 -1.419728
C  0.502697 1.791945 0.155924
C  -3.126615 -1.365882 -1.038416
C  2.824383 0.628185 -0.114391
C  -1.756103 1.147534 -2.148527
C  1.475605 -1.786946 -1.043026
C  -4.23647 0.961258 -0.624484
C  3.516456 -0.744258 -0.032302
C  3.450636 1.618122 0.897536
C  2.749638 -1.872676 -0.567127
C  4.989794 1.64727 0.791516
C  4.789508 -0.882762 0.473492
C  -4.606095 2.045922 0.37693
C  5.600144 0.255305 0.947923
C  -4.082315 -0.754184 1.861634
C  -3.744501 -1.04104 3.307316
H  -0.822253 -1.058502 0.433522
H  0.740863 -0.019059 -1.990764
H  1.12745 -0.010326 1.060677
H  -1.22732 1.300492 1.30584
H  -1.496355 2.624875 0.141558
H  -1.43214 -2.797247 -1.146416
H  -1.492372 -1.650544 -2.508035
H  0.865028 2.405854 0.995208
H  -3.777396 -1.254952 -1.921224
H  -3.598287 -2.120379 -0.388679
H  2.995415 1.028421 -1.137671
H  -2.249146 2.135559 -2.140378
H  -0.76574 1.293642 -2.604727
H  -2.355062 0.493971 -2.80299
H  0.996233 -2.668996 -1.481324
H  3.15678 1.324901 1.926375
H  3.056151 2.633013 0.710541
H  5.44322 2.31738 1.542323
H  5.286844 2.034978 -0.205561
H  5.266714 -1.867795 0.520997
H  -3.7810 2.294383 1.063451
H  -4.937907 2.943619 -0.170215
H  -5.461038 1.690294 0.982084
H  -3.160036 -0.215595 3.745813
H  -3.126772 -1.955553 3.370488
H  -4.669835 -1.199672 3.879969
