program: Gaussian 09
title: 000197704
version: EM64L-G09RevD.01
frameworkgroup: C1[X(C17H25Br2NO2)]
method: RPBEPBE
basis: SDD
operation: Freq
keyword: #p
keyword: freq=noraman
keyword: PBEPBE/SDD
title: #p freq=noraman PBEPBE/SDD
converged: YES YES NO NO
title: Mulliken charges:
elementType: Br Br O O N C C C C C C C C C C C C C C C C C H H H H H H H H H H H H H H H H H H H H H H H H H
charge: 0.083190 0.060574 -0.274595 -0.235376 -0.119235 -0.384106 -0.387388 -0.385999 -0.372292 -0.377478 -0.380005 -0.369526 -0.467533 -0.462179 -0.401363 0.180004 -0.130680 -0.310074 0.078163 0.284010 -0.542676 -0.501956 0.196403 0.194784 0.195624 0.199981 0.195444 0.199010 0.199145 0.192747 0.202386 0.192994 0.222245 0.201698 0.202088 0.219652 0.213670 0.219070 0.215141 0.233673 0.264781 0.241510 0.245844 0.252561 0.233113 0.244936 0.238021
chargesum: 0.00000
title: Mulliken charges with hydrogens summed into heavy atoms:
elementType: Br Br O O N C C C C C C C C C C C C C C C C C
charge: 0.083190 0.060574 -0.274595 -0.235376 -0.119235 0.007081 0.008217 0.008455 0.019600 0.017902 0.043937 0.052214 -0.034793 -0.013365 -0.136583 0.180004 0.110830 -0.064230 0.330724 0.284010 -0.542676 0.214114
polarizability: 3.22817929e+02 -2.47285297e+00 2.25048768e+02 -3.61214283e-01 -2.06173423e+01 1.83578968e+02
1716.lowfreq: -3.2523 -0.0010 0.0003 0.0005 2.9329 6.7075 8.5468 10.3376 12.5554
frequency: 8.0842 10.2298 12.4648 20.8577 24.7979 36.4197 47.4768 54.5533 65.5187 78.9787 82.4648 97.7557 105.3034 118.5962 124.2049 133.6909 142.4858 151.5112 158.6056 165.1687 176.8562 187.6738 195.0959 226.8754 248.0707 261.2122 291.5227 319.8618 343.0250 367.4943 394.2360 421.4453 431.1805 458.6909 474.0792 495.8494 515.6238 563.2133 597.0975 670.7678 720.3416 722.3125 727.1923 735.3912 740.6494 765.9137 803.4327 824.4795 840.7040 865.1853 878.0457 893.2174 938.7203 970.9956 976.8223 977.9120 982.4332 997.6542 1013.4992 1015.4146 1026.5456 1046.8697 1053.0769 1065.5854 1077.1098 1079.4706 1088.3863 1112.3843 1128.7738 1131.5351 1138.4384 1148.8685 1193.2733 1200.0537 1221.8819 1227.2995 1246.7380 1249.4925 1261.5678 1269.6158 1275.1751 1280.9450 1285.4620 1290.3674 1293.1939 1296.5446 1299.6489 1309.3597 1322.9698 1328.8932 1340.4045 1349.7146 1357.2567 1357.5931 1423.2076 1451.7288 1455.7241 1458.4167 1461.4370 1462.0238 1463.9943 1464.7597 1468.5636 1476.3963 1483.4003 1488.1445 1624.1658 1629.8062 1637.3638 1721.5525 2952.0385 2952.4926 2954.0478 2955.7665 2958.3980 2964.4746 2965.6182 2974.0359 2974.9088 2986.8230 2992.8067 3001.5130 3002.8927 3014.6299 3023.2739 3032.2425 3041.9096 3051.4381 3062.2601 3089.0849 3101.3847 3103.5356 3120.9879 3147.9058 3153.2085
redmass: 8.5075 9.3282 6.7166 6.2856 5.6668 4.8771 4.9829 4.3773 1.8092 2.6982 4.0391 1.1668 1.9599 2.5098 3.7380 4.3596 2.5083 2.1484 2.3573 4.1365 7.9366 4.9998 3.2568 3.0628 4.3174 5.0138 6.8761 4.0704 3.8493 4.9013 4.7602 4.1342 3.4027 3.9625 4.0040 4.2465 3.4956 5.0529 5.7994 5.7243 2.0095 1.0683 1.1833 7.6553 1.2856 1.3016 1.3787 1.3519 1.6161 4.6695 1.8349 2.6641 1.4366 1.6077 1.6993 3.0953 2.0951 1.9597 2.5022 2.1815 3.8998 2.2226 2.0393 2.1068 2.3737 2.1230 3.6546 1.2678 1.9197 2.6423 2.4376 1.4870 1.6901 1.2184 1.5397 1.2971 1.8349 1.2670 1.9182 1.2285 1.2223 1.0876 1.1565 1.2004 1.1556 1.1406 1.1299 1.2726 1.4724 1.4271 1.4135 1.5149 1.5871 1.6502 1.1879 1.0499 1.0931 1.0802 1.0755 1.0742 1.0513 1.0591 1.0943 1.0992 1.1007 1.1007 8.6891 6.3198 9.5636 10.9427 1.0589 1.0587 1.0596 1.0621 1.0596 1.0601 1.0630 1.0617 1.0610 1.0962 1.0977 1.1001 1.0297 1.1007 1.0996 1.1020 1.1029 1.1036 1.0984 1.0917 1.0894 1.1043 1.0903 1.1046 1.0899
irintensity: 0.3731 0.4315 0.1961 1.2400 0.1520 0.9819 0.6451 1.1035 0.1034 0.5524 0.5385 0.2674 0.2094 0.0172 0.4984 0.8764 0.1835 0.3241 0.3135 1.0918 3.3440 1.4723 0.3456 4.3735 5.4835 1.8680 9.7400 9.0241 2.8485 1.5173 6.8780 1.5711 3.8591 4.3088 12.1644 3.1444 2.2506 8.5153 3.2227 12.3186 104.4167 10.6134 20.1176 8.0887 10.9394 23.1709 9.3825 13.9159 7.7773 15.2363 13.6175 2.6449 9.1968 43.0118 18.3847 16.2491 26.8523 15.3626 0.8228 18.0347 11.5836 6.6859 3.6244 8.2054 0.2767 0.2124 2.1873 0.1586 16.4750 140.9733 237.3585 1.9998 2.7850 40.8647 0.2036 6.3386 9.1550 9.1941 21.6060 4.8170 6.9312 2.4551 0.5157 2.7895 2.2732 0.8128 0.4044 4.7712 55.8023 46.3960 1.7987 0.9542 0.1142 0.2121 23.6046 13.6365 4.6903 2.5574 1.0223 2.1471 12.3178 0.2238 0.0165 5.3919 0.0046 33.4274 24.8569 21.5503 139.9021 127.9382 0.0311 0.0205 1.7576 18.2272 0.0545 63.7913 17.1309 23.9444 137.7452 3.2512 0.0812 3.7578 36.0536 0.7516 5.7198 0.2623 67.8296 139.0357 57.3026 17.4469 8.7298 27.2469 17.6462 18.3155 6.1068
temp: 298.150 k
press: 1.00000 atm
elementType: 35 35 8 8 7 6 6 6 6 6 6 6 6 6 6 6 6 6 6 6 6 6 1 1 1 1 1 1 1 1 1 1 1 1 1 1 1 1 1 1 1 1 1 1 1 1 1
symmnumber: 1
zpe: 1003500.7 jmol-1
zpe.correction: 0.382213 hartree
zpe.thermalcorrener: 0.409559 hartree
zpe.thermalcorrenthalpy: 0.410503 hartree
zpe.thermalcorrgfe: 0.314537 hartree
zpe.sumelectzpe: -893.103574 hartree
zpe.sumelectthermal: -893.076228 hartree
zpe.sumelectthermalent: -893.075284 hartree
zpe.sumelectthermalfe: -893.171250 hartree
dipole: -0.9681 -0.4456 -4.6189
dipole: 4.7402
quadrupole: -227.7656 -140.6597 -155.4578
quadrupole: 9.8309 -23.5579 -3.5296
quadrupole: -53.1379 33.9680 19.1699 9.8309 -23.5579 -3.5296
hfenergy: -893.4857872 hartree
pointgroup: C01 [X(C17H25Br2N1O2)]
dipole: -0.5321708 -0.0833048 -1.7854695 debye
polarizability: 321.5600313|-6.0475693|227.0059678|-12.4707775|-18.1730477|182.8796664 unknown
InChI: InChI=1S/C17H25Br2NO2/c1-22-17(21)16-14(20-16)12-10-8-6-4-2-3-5-7-9-11-13-15(18)19/h10,12-13,16H,2-9,11H2,1H3
charge 0 multiplicity 1
47 atoms
Br -10.798546 2.07985 1.329257
Br -9.664674 -0.770322 2.492773
O  7.733599 2.165229 -0.424109
O  6.519779 1.643211 1.506908
N  7.560423 -1.255309 1.105526
C  -2.315404 -1.146919 -0.285687
C  -0.898028 -0.5463 -0.148689
C  -3.440158 -0.121479 -0.017676
C  0.225004 -1.573717 -0.415306
C  -4.856211 -0.726658 -0.145781
C  1.640375 -0.973716 -0.261155
C  -5.979073 0.296992 0.134855
C  2.760223 -2.017998 -0.537165
C  -7.393627 -0.33148 0.003316
C  7.265592 -0.11766 -0.034076
C  6.400717 -1.209273 0.502558
C  4.138311 -1.424619 -0.422251
C  5.112756 -1.848137 0.43902
C  -8.491072 0.683276 0.22819
C  7.110485 1.276048 0.464197
C  -9.460075 0.657062 1.172706
C  7.663518 3.594608 -0.040261
H  -2.42174 -1.998361 0.418523
H  -2.438571 -1.568979 -1.30511
H  -0.790769 0.305751 -0.851964
H  -0.77559 -0.125357 0.870851
H  -3.337953 0.728386 -0.724385
H  -3.313724 0.302992 0.999973
H  0.111255 -2.429679 0.281893
H  0.109896 -1.987576 -1.439097
H  -4.955036 -1.579882 0.55696
H  -4.986074 -1.145772 -1.165687
H  1.766102 -0.567853 0.761775
H  1.757547 -0.117663 -0.956756
H  -5.885586 1.151427 -0.566395
H  -5.860603 0.711247 1.155496
H  2.616479 -2.410844 -1.566579
H  2.649776 -2.875578 0.153662
H  -7.504634 -0.748488 -1.019723
H  -7.493178 -1.176191 0.707762
H  7.818918 -0.239934 -0.968988
H  4.361121 -0.566109 -1.075668
H  4.940503 -2.693837 1.11812
H  -8.49281 1.551626 -0.447314
H  8.190372 4.128115 -0.843698
H  8.158285 3.751737 0.932953
H  6.6126 3.922633 0.033643
