program: Gaussian 09
title: 000197690
version: EM64L-G09RevD.01
frameworkgroup: C1[X(C17H18N2O3S)]
method: RPBEPBE
basis: SDD
operation: Freq
keyword: #p
keyword: freq=noraman
keyword: PBEPBE/SDD
title: #p freq=noraman PBEPBE/SDD
converged: YES YES NO NO
title: Mulliken charges:
elementType: S O O O N N C C C C C C C C C C C C C C C C C H H H H H H H H H H H H H H H H H H
charge: 0.312341 -0.444422 -0.368747 -0.251826 0.034503 -0.680995 -0.101244 0.379889 -0.449947 -0.548043 -0.484738 -0.451787 0.345851 -0.659472 0.227619 0.009045 0.032647 -0.748199 0.164827 -0.313415 -0.011173 0.016703 -0.741426 0.238021 0.231084 0.229854 0.233166 0.213759 0.233123 0.255272 0.348799 0.404736 0.340341 0.240018 0.240718 0.242319 0.260656 0.260022 0.254800 0.253517 0.251802
chargesum: 0.00000
title: Mulliken charges with hydrogens summed into heavy atoms:
elementType: S O O O N N C C C C C C C C C C C C C C C C C
charge: 0.312341 -0.095623 -0.368747 -0.251826 0.034503 0.064082 0.136777 0.379889 -0.003022 -0.087105 0.003656 -0.451787 0.345851 -0.659472 0.227619 0.009045 0.032647 -0.025143 0.164827 0.207263 -0.011173 0.016703 0.018693
polarizability: 3.29589260e+02 -2.41720106e+00 2.73108339e+02 -4.99096697e+00 6.37430985e+00 1.20078645e+02
1716.lowfreq: -3.8547 -3.5997 -0.0016 -0.0010 -0.0008 6.2221 13.3021 22.5231 34.5961
frequency: 13.2704 22.5112 34.5834 36.5076 43.1962 45.1599 83.6158 101.8903 121.4252 133.7396 175.9993 187.1526 192.6826 199.2668 228.0097 229.9224 257.4751 292.9470 298.3786 307.2726 325.6693 344.9927 345.9610 355.3347 365.0558 367.4916 377.9575 401.2103 418.9363 464.8463 474.1149 492.2770 502.5984 530.9514 546.6984 573.1106 610.8689 619.5283 633.6588 643.8851 689.0548 716.5444 734.9225 753.6633 790.5564 798.2105 815.7071 830.0906 875.0083 876.9353 900.3032 946.9206 961.7115 970.5952 977.3586 980.2650 991.2660 1019.2527 1030.4891 1034.6761 1042.3807 1066.4247 1094.8975 1108.5887 1149.9478 1165.0506 1168.2651 1171.2528 1185.1537 1189.4124 1203.2758 1256.8526 1285.3931 1296.9447 1305.8272 1333.5729 1343.3515 1347.9058 1351.5746 1361.2958 1371.7624 1394.8897 1399.1562 1402.8007 1419.2602 1443.8120 1455.6375 1456.7723 1458.1052 1458.6562 1460.0091 1462.7286 1477.6420 1514.8622 1554.7873 1575.8283 1605.5629 1617.5717 2293.8362 2943.9648 2976.0070 2979.6988 2990.5543 3000.6222 3005.3574 3009.2908 3035.7015 3060.1089 3060.6243 3066.9113 3069.0934 3070.4817 3080.5736 3122.9159 3408.8404 3534.5737 3669.7983
redmass: 4.6854 1.0089 7.4040 4.4111 4.5044 4.4236 5.3724 4.3555 4.7148 4.6713 5.5886 4.8371 2.5547 3.3871 2.8385 1.3974 2.7511 4.9273 5.7610 6.4524 4.3386 2.9551 1.8665 4.2634 2.2740 2.1301 4.5759 3.9297 3.6777 6.0811 5.8753 1.2245 7.4731 5.1270 5.6517 5.1895 5.6651 6.3298 5.6685 4.6304 5.4369 4.9559 3.7142 1.2664 3.3656 6.0962 2.2081 5.2939 2.3454 8.8201 6.6233 3.0074 4.3543 1.6451 2.4150 2.7526 2.4925 2.9856 1.4064 1.3857 1.5911 2.1363 2.3414 1.9315 1.5039 1.6018 1.2277 2.4880 3.3465 1.0573 1.5483 1.5334 2.5514 1.5853 2.7273 1.8424 1.7345 2.9563 1.6413 2.6253 1.1786 4.8677 1.2701 1.2222 3.5493 1.1138 1.2397 1.1108 1.1029 1.1260 1.0411 1.0415 1.1543 4.7929 7.2160 5.4297 4.9504 1.5063 11.6602 1.0623 1.0631 1.0351 1.0709 1.0366 1.0564 1.0885 1.0972 1.1055 1.0907 1.0982 1.0981 1.0989 1.0955 1.1016 1.0580 1.0658 1.0917
irintensity: 0.0720 0.0284 1.2776 0.3885 0.2212 0.4126 0.5196 2.9668 2.7886 3.3290 2.7744 3.7593 17.3081 1.5186 0.6808 0.1964 7.2307 9.9518 4.2646 1.2401 7.3059 0.3573 54.1023 0.5574 41.0527 2.5138 3.5953 11.8701 10.2094 4.7610 6.7521 85.2292 0.8580 6.0236 0.8703 3.8569 0.9028 3.2476 1.8135 5.1278 1.1323 5.0100 2.9623 102.9573 17.6249 0.4458 23.7434 55.9554 3.0048 19.1548 8.7232 82.2473 251.4489 0.9827 40.6081 62.5235 24.6368 196.0485 3.1883 4.6484 4.7762 29.7132 62.4135 54.0168 18.4853 63.0587 37.8393 119.9915 6.3065 1.4089 9.2372 13.8180 20.2833 15.7260 37.3121 12.3881 9.6467 100.7794 19.3153 15.2625 34.7448 25.5717 28.1946 4.5265 11.3421 14.6914 37.4521 17.8444 12.3765 2.3663 15.4559 13.7857 6.7309 124.0343 470.4862 0.5486 448.0481 50.5370 28.2832 26.0543 27.5467 27.7591 18.7825 9.8306 12.5464 29.3817 12.0400 7.6363 47.5417 44.7275 11.7452 12.3455 10.0367 18.3076 298.5213 3.2090 111.3179
temp: 298.150 k
press: 1.00000 atm
elementType: 16 8 8 8 7 7 6 6 6 6 6 6 6 6 6 6 6 6 6 6 6 6 6 1 1 1 1 1 1 1 1 1 1 1 1 1 1 1 1 1 1
symmnumber: 1
zpe: 833975.7 jmol-1
zpe.correction: 0.317645 hartree
zpe.thermalcorrener: 0.340530 hartree
zpe.thermalcorrenthalpy: 0.341474 hartree
zpe.thermalcorrgfe: 0.262612 hartree
zpe.sumelectzpe: -1390.136597 hartree
zpe.sumelectthermal: -1390.113711 hartree
zpe.sumelectthermalent: -1390.112767 hartree
zpe.sumelectthermalfe: -1390.191629 hartree
dipole: -2.1233 -5.9139 -1.6032
dipole: 6.4848
quadrupole: -128.1822 -142.9551 -144.2538
quadrupole: 13.7649 -8.6024 6.2129
quadrupole: 10.2815 -4.4914 -5.7901 13.7649 -8.6024 6.2129
hfenergy: -1390.4542412 hartree
pointgroup: C01 [X(C17H18N2O3S1)]
dipole: 0.6528083 -2.3535421 0.7375477 debye
polarizability: 329.7683181|-1.663533|272.3255902|-1.6630696|-12.1497338|120.6823361 unknown
InChI: InChI=1S/C17H18N2O3S/c1-3-4-7-22-17(21)13-9(2)19-16-14(15(13)18)11-6-5-10(20)8-12(11)23-16/h10,20H,5-8,18H2,1-2H3
charge 0 multiplicity 1
41 atoms
S  -3.432588 2.084965 -0.120573
O  -4.601151 -2.150581 -1.541854
O  3.019204 -0.040025 0.019526
O  3.402274 2.23536 -0.148279
N  -0.826788 2.985906 -0.195307
N  0.645956 -0.997005 0.10569
C  -4.83902 -1.868933 -0.111973
C  -2.377372 -0.363179 0.17848
C  -3.717909 -2.463433 0.767406
C  -2.330983 -1.871465 0.407433
C  -4.965028 -0.347544 0.145279
C  -3.597729 0.291479 0.093418
C  -1.238408 0.547288 0.05528
C  -1.629062 1.904384 -0.088797
C  0.182685 0.293902 0.039294
C  1.079385 1.436269 -0.060969
C  0.516037 2.77021 -0.169773
C  1.341588 4.034883 -0.271779
C  2.553172 1.310866 -0.070755
C  4.512563 -0.186371 0.006584
C  4.838709 -1.60881 0.084699
C  5.166336 -2.796727 0.147021
C  5.561663 -4.210715 0.222852
H  -5.798875 -2.36984 0.098114
H  -1.94844 -2.386751 -0.499834
H  -1.636103 -2.109913 1.236856
H  -3.694056 -3.560773 0.644874
H  -3.952363 -2.248881 1.828588
H  -5.441102 -0.174071 1.131426
H  -5.636621 0.093235 -0.615534
H  -3.894114 -1.535032 -1.868398
H  1.66128 -1.146659 0.095669
H  -0.000806 -1.777768 0.130738
H  2.007378 4.162837 0.599186
H  2.006853 4.02246 -1.152451
H  0.643809 4.883217 -0.339688
H  4.894679 0.27877 -0.920346
H  4.92053 0.382665 0.861756
H  6.555104 -4.316456 0.695886
H  5.612759 -4.669333 -0.78123
H  4.840758 -4.791829 0.826584
