program: Gaussian 09
title: 000017261
version: EM64L-G09RevD.01
frameworkgroup: C1[X(C20H23Cl2N3O)]
method: RPBEPBE
basis: SDD
operation: Freq
keyword: #p
keyword: freq=noraman
keyword: PBEPBE/SDD
title: #p freq=noraman PBEPBE/SDD
converged: YES YES NO NO
title: Mulliken charges:
elementType: Cl Cl O N N N C C C C C C C C C C C C C C C C C C C C H H H H H H H H H H H H H H H H H H H H H H H
charge: -0.023466 -0.023531 -0.265682 -0.222530 -0.072670 -0.077631 -0.414073 0.218176 0.331608 -0.371632 -0.688657 -0.031843 0.522865 -0.356391 -0.324776 -0.085398 -0.081851 -0.616173 -0.611003 -0.431252 -0.395282 -0.375366 -0.350085 0.327031 -0.245406 -0.683881 0.237011 0.234415 0.226197 0.234413 0.269621 0.222434 0.274460 0.279156 0.194578 0.225374 0.227906 0.222080 0.208682 0.215614 0.230930 0.253584 0.252011 0.248723 0.211033 0.207202 0.209129 0.231092 0.233256
chargesum: 0.00000
title: Mulliken charges with hydrogens summed into heavy atoms:
elementType: Cl Cl O N N N C C C C C C C C C C C C C C C C C C C C
charge: -0.023466 -0.023531 -0.265682 -0.222530 -0.072670 -0.077631 0.057353 0.218176 0.331608 0.088979 -0.196603 -0.031843 0.522865 -0.081931 -0.045620 -0.085398 -0.081851 0.031686 0.035372 -0.200322 -0.141698 -0.123355 -0.101362 0.327031 0.172829 -0.010404
polarizability: 3.65216798e+02 -1.59935051e+01 2.29241514e+02 2.44342705e+01 -4.61917805e-01 2.08266769e+02
1716.lowfreq: -5.5507 -2.4149 -0.7695 -0.0022 -0.0021 -0.0017 10.9527 18.4168 19.7339
frequency: 10.7949 18.1853 19.7322 37.3870 40.3176 44.3923 54.6643 80.7555 103.7495 114.7332 119.1895 123.9517 142.7223 169.2857 181.3029 187.4885 204.7443 218.9833 227.8445 239.8252 243.5752 252.9401 286.5779 307.5105 314.2774 336.7198 341.5615 358.6350 367.3501 395.4441 409.6904 413.6363 425.3927 430.7203 437.6956 463.0224 510.1707 549.8694 564.7325 613.5285 629.7537 631.9070 647.3357 682.7595 706.6225 729.0751 749.0149 763.5370 769.2808 787.5170 808.4751 816.6167 829.5088 834.7863 839.6861 850.7905 880.3141 882.6527 903.0470 918.3817 931.1518 958.3124 965.0257 1003.3631 1020.0857 1034.6401 1036.9743 1054.5245 1072.9473 1081.6081 1091.5324 1111.0516 1115.2888 1119.3789 1135.9203 1139.0458 1153.4296 1180.3833 1195.2232 1205.7098 1212.8513 1226.5890 1235.8510 1247.0596 1262.6512 1266.5107 1288.9568 1294.7236 1313.8621 1316.5609 1326.3122 1361.5814 1366.7177 1378.0022 1381.6922 1385.9287 1401.9880 1411.3133 1419.6604 1422.5026 1445.1797 1447.7189 1453.7398 1461.1027 1461.8094 1467.4189 1475.2187 1477.2116 1480.3019 1484.7511 1487.6569 1489.8522 1491.4556 1503.4267 1578.7805 1582.3757 1620.2505 1622.8346 2865.7777 2876.0655 2891.6788 2954.9223 2991.8284 2997.9724 3013.2420 3020.9343 3022.2642 3028.0703 3033.0091 3051.9325 3077.9864 3082.3996 3094.2415 3095.3888 3106.4319 3116.6757 3127.9574 3161.2855 3164.2953 3165.3259 3182.4601
redmass: 4.7904 3.2847 4.8731 4.6767 5.3200 3.5134 4.5429 5.9484 5.7360 2.4142 1.8379 4.6181 5.5767 3.4041 5.5944 6.3985 3.7676 1.5198 1.8872 1.6333 1.1915 3.3221 3.4894 4.9596 4.0641 3.8730 3.3950 4.4203 4.9750 3.9130 4.9969 2.9777 3.1929 3.2827 2.9947 3.7763 2.9419 4.0938 4.7375 6.1552 7.3098 7.1827 5.8003 6.5327 3.6118 4.4142 4.0403 5.0525 5.9503 1.3132 2.0397 1.5987 3.7004 1.2141 1.7162 1.5046 1.5069 3.3515 3.3563 3.6043 2.0480 1.6050 1.3567 2.7622 2.8168 1.6121 2.7950 2.4407 1.9121 1.9324 1.3087 1.8307 2.9955 1.7556 1.4357 1.5110 1.6003 1.2876 1.8450 2.1414 1.8280 3.5651 2.6974 1.7347 1.1426 2.5202 1.6426 1.3707 1.6968 1.4435 1.6185 2.4294 1.7263 4.2723 1.4279 3.4261 1.3024 5.2437 2.7233 1.2263 1.1656 3.7375 1.1281 1.0400 1.0550 1.0688 1.0712 1.0952 1.1184 1.0729 1.1750 2.4442 1.5351 1.9759 9.9574 7.0896 8.4635 6.2878 1.0555 1.0574 1.0669 1.0554 1.0620 1.0363 1.1075 1.0625 1.0742 1.0766 1.0875 1.0980 1.1015 1.1007 1.1011 1.0989 1.1014 1.0894 1.0895 1.0939 1.0949 1.0931 1.0933
irintensity: 0.3684 0.7788 0.0081 0.0938 0.1403 0.9722 1.7281 0.0354 1.8119 0.8702 1.8827 0.3608 0.8403 0.7015 0.5473 0.3778 0.3375 0.5607 1.1895 1.1656 0.6448 1.1053 0.4135 2.6940 1.1576 1.8489 8.4142 0.4601 9.1350 1.3713 3.8176 0.8690 8.3925 2.9372 4.0644 1.0200 17.7446 20.3114 7.4333 11.0471 7.5662 8.4827 7.2442 4.0290 3.7099 12.0616 0.8946 5.5653 27.2651 20.9475 30.5619 0.9537 12.9549 10.6217 32.3373 16.5477 26.9223 37.7597 34.3690 21.4845 9.8101 2.5954 0.5569 7.3848 11.3880 16.5050 67.3378 20.1374 21.3398 38.0795 9.2244 4.6143 1.5043 9.0080 4.0012 23.8724 31.5918 99.1123 10.2198 8.3768 4.7029 229.9382 5.4095 5.5084 0.0518 5.6511 6.7493 9.5374 0.8963 2.3911 8.4545 50.7009 33.8329 29.8756 5.2681 20.4953 39.1710 10.2250 0.7685 8.9515 5.4422 134.4196 28.9420 12.0303 10.1112 19.0825 24.2939 33.5398 10.5479 16.5899 49.0765 15.9639 63.4319 91.4273 5.7174 10.2751 5.8727 46.3644 68.5104 82.2393 104.8374 34.7693 21.3907 26.0964 36.1026 15.1827 34.8856 57.0817 14.3945 4.2344 9.8924 64.3313 24.9957 27.6322 33.8629 15.8160 7.9480 12.3506 5.9845 0.6542 0.1464
temp: 298.150 k
press: 1.00000 atm
elementType: 17 17 8 7 7 7 6 6 6 6 6 6 6 6 6 6 6 6 6 6 6 6 6 6 6 6 1 1 1 1 1 1 1 1 1 1 1 1 1 1 1 1 1 1 1 1 1 1 1
symmnumber: 1
zpe: 1024627.3 jmol-1
zpe.correction: 0.390260 hartree
zpe.thermalcorrener: 0.416366 hartree
zpe.thermalcorrenthalpy: 0.417310 hartree
zpe.thermalcorrgfe: 0.330052 hartree
zpe.sumelectzpe: -1933.597526 hartree
zpe.sumelectthermal: -1933.571420 hartree
zpe.sumelectthermalent: -1933.570476 hartree
zpe.sumelectthermalfe: -1933.657734 hartree
dipole: -6.3995 2.0751 0.3582
dipole: 6.7371
quadrupole: -184.6108 -168.6098 -157.8111
quadrupole: 2.3996 -11.8522 -5.9267
quadrupole: -14.2668 1.7341 12.5328 2.3996 -11.8522 -5.9267
hfenergy: -1933.987786 hartree
pointgroup: C01 [X(C20H23Cl2N3O1)]
dipole: 1.9739713 1.6193406 -0.7118531 debye
polarizability: 319.6471796|71.6740214|270.1146325|7.028468|-8.7575433|212.9632691 unknown
InChI: InChI=1S/C20H23Cl2N3O/c1-4-26-15-7-5-14(6-8-15)11-20-23-18-12-16(21)17(22)13-19(18)25(20)10-9-24(2)3/h5-8,12-13H,4,9-11H2,1-3H3
charge 0 multiplicity 1
49 atoms
Cl -5.846014 -1.802524 -1.272476
Cl -5.121827 -4.473969 0.46641
O  4.891143 1.493569 -0.545652
N  -1.655735 0.326603 1.246191
N  -1.152508 -1.545808 2.476439
N  -1.017826 3.009603 -1.374178
C  -1.570789 1.67732 0.667437
C  -0.812376 -0.268482 2.209537
C  -2.595732 -0.647024 0.878534
C  -0.93952 1.671475 -0.749326
C  0.341798 0.443288 2.861149
C  -2.269659 -1.8083 1.656761
C  1.531496 0.701465 1.931645
C  -3.682216 -0.621576 -0.016682
C  -3.041637 -2.982634 1.532086
C  -4.43983 -1.803643 -0.124754
C  -4.124574 -2.965885 0.63484
C  -0.917369 2.949356 -2.848641
C  -0.058319 3.979017 -0.801086
C  2.161633 1.971678 1.886901
C  2.05239 -0.333034 1.118144
C  3.27336 2.205928 1.055313
C  3.167872 -0.118504 0.278664
C  3.782415 1.15973 0.245715
C  5.483265 0.432624 -1.386556
C  6.666048 1.058674 -2.119907
H  -2.584688 2.112081 0.600287
H  -0.981548 2.308238 1.351984
H  0.106925 1.284758 -0.681951
H  -1.509512 0.965162 -1.380973
H  0.650229 -0.20456 3.701655
H  0.004656 1.400245 3.304615
H  -3.950561 0.258289 -0.607577
H  -2.808014 -3.875183 2.117175
H  0.076124 2.586114 -3.21297
H  -1.086454 3.956087 -3.270878
H  -1.696901 2.277496 -3.249445
H  -0.197291 4.960751 -1.287164
H  1.007774 3.667151 -0.932554
H  -0.240237 4.115648 0.279146
H  1.783886 2.788486 2.515082
H  1.582093 -1.32339 1.143947
H  3.765815 3.182619 1.020642
H  3.545134 -0.943755 -0.332363
H  5.8086 -0.409017 -0.740989
H  4.720084 0.057192 -2.099254
H  7.151039 0.306862 -2.768724
H  6.332872 1.901351 -2.749364
H  7.413888 1.436128 -1.402034
