program: Gaussian 09
title: 000197669
version: EM64L-G09RevD.01
frameworkgroup: C1[X(C23H28O6)]
method: RPBEPBE
basis: SDD
operation: Freq
keyword: #pfreq=noraman
keyword: PBEPBE/SDD
title: #p freq=noraman PBEPBE/SDD
converged: YES YES NO NO
title: Mulliken charges:
elementType: O O O O O O C C C C C C C C C C C C C C C C C C C C C C C H H H H H H H H H H H H H H H H H H H H H H H H H H H H
charge: -0.299944 -0.241492 -0.307728 -0.244286 -0.427645 -0.250719 0.242784 0.347418 0.343631 -0.240396 -0.105192 -0.476791 -0.541482 -0.138475 -0.830075 -0.509433 -0.856730 -0.444901 -0.550409 0.450412 0.224394 -0.824998 -0.362897 -0.136306 -0.186970 -0.190224 -0.135689 -0.310269 0.159244 0.261736 0.280167 0.225882 0.219886 0.250990 0.264041 0.223908 0.254894 0.205846 0.243891 0.241024 0.204338 0.261178 0.225907 0.237854 0.222386 0.213868 0.228530 0.232322 0.225358 0.219028 0.257754 0.264539 0.237826 0.238993 0.264474 0.258462 0.380085
chargesum: 0.00000
title: Mulliken charges with hydrogens summed into heavy atoms:
elementType: O O O O O O C C C C C C C C C C C C C C C C C C C C C C C
charge: -0.299944 -0.241492 -0.307728 -0.244286 -0.047560 -0.250719 0.242784 0.347418 0.343631 0.021339 0.174975 -0.031023 -0.026451 0.085433 -0.125444 -0.064071 -0.131791 -0.222515 -0.108010 0.450412 0.224394 -0.148290 -0.105144 0.128233 0.050856 0.048770 0.128785 -0.051807 0.159244
polarizability: 5.62522846e+02 -2.69755508e+01 2.54900636e+02 -1.18196818e+01 -9.42575638e+00 1.93781595e+02
1716.lowfreq: -3.9447 -0.0007 -0.0005 0.0007 3.6927 12.2723 15.7243 18.4078 24.3032
frequency: 15.4279 17.2850 24.2222 41.4314 44.7575 59.8371 82.9142 97.2042 101.6203 108.2682 128.8672 145.7982 153.0316 165.9751 175.6926 186.3487 191.0916 195.2848 206.4154 236.8701 241.3169 248.7570 256.3204 262.9809 281.1926 295.0149 299.4598 312.2112 325.4832 332.9721 339.1788 355.1503 366.5369 369.1535 389.1708 408.8577 432.0371 445.1442 466.1921 486.7742 510.5974 529.1166 532.9510 546.1563 571.0283 585.1202 595.8250 620.6080 622.0657 665.9710 689.2671 690.0160 703.9386 735.0750 758.2646 761.1001 789.7630 802.9210 817.6466 846.4839 849.0461 884.5471 885.6486 894.9601 903.3179 905.0742 913.3640 920.2624 923.0250 928.0919 943.6300 944.3286 965.3847 970.5557 990.4698 997.1706 1001.1503 1029.3583 1031.6839 1033.2090 1041.0525 1042.4250 1046.5653 1050.8225 1078.9152 1094.3340 1101.4411 1108.2867 1121.2755 1132.0386 1144.0709 1153.6713 1164.5992 1168.9279 1180.0526 1183.7296 1199.7463 1214.1850 1218.2852 1225.9669 1240.9706 1245.5758 1268.7484 1268.9526 1278.8508 1288.0550 1293.1146 1300.6711 1306.5781 1308.5487 1316.8809 1319.1989 1334.6117 1353.9340 1357.4732 1362.5254 1370.9958 1385.9839 1392.2112 1397.0079 1406.5959 1453.0994 1460.0109 1460.9760 1462.0250 1469.0525 1470.9938 1478.2608 1484.5563 1489.4826 1501.9471 1582.7440 1599.2640 1613.3392 1637.8079 1644.1842 1692.5815 2954.1626 2961.4018 2972.4429 2989.9292 2992.1609 2998.6382 3003.2324 3029.1214 3031.9060 3041.2728 3058.8577 3060.1324 3081.5180 3081.7402 3083.0272 3084.3634 3092.6769 3095.3132 3095.4819 3100.2678 3110.3201 3114.9498 3117.0434 3122.3004 3149.8353 3157.5187 3158.4639 3526.0144
redmass: 5.6217 5.6388 6.0045 6.2282 5.1052 10.3668 4.1128 3.8951 4.1354 4.6620 3.2605 4.7755 1.2767 1.1986 3.1395 2.5441 3.2628 3.4382 1.4640 2.3915 3.6983 6.0420 3.7069 1.6603 3.4356 4.0292 3.1707 2.6508 3.2963 3.5716 3.3171 3.1194 2.7459 3.3719 5.3122 2.8046 2.9940 3.9107 3.3179 2.9867 3.8773 3.7969 4.3647 4.2139 4.0717 1.2368 4.4061 4.4433 4.2881 4.2495 4.4601 4.0083 5.4696 3.2668 2.9384 2.3847 2.7128 3.1546 2.7169 1.7759 1.9387 2.6683 1.8407 2.4937 2.2647 2.9194 3.2080 2.7799 1.9590 3.4441 1.2840 2.0133 2.0701 2.2355 2.0439 1.1667 2.8202 2.7269 1.4906 1.1036 1.8966 1.9924 1.5400 2.3215 2.1322 2.0494 2.7450 1.8997 1.7912 1.9083 1.8302 1.8053 1.5127 1.6012 2.5245 1.9901 2.6298 1.4615 1.6968 1.6142 2.2103 1.4665 1.7281 1.9762 1.3756 1.5251 1.3359 1.3906 1.2441 1.5754 1.3601 1.5154 1.3157 1.6197 1.7161 1.5278 1.8604 1.2514 1.5763 1.2485 1.7005 1.0744 1.0795 1.0528 1.0790 1.0667 1.0724 1.1989 1.2001 1.0538 1.0538 5.6020 8.7435 7.5002 6.1850 5.7823 6.7060 1.0583 1.0413 1.0834 1.0528 1.0554 1.0414 1.0811 1.0629 1.0965 1.0838 1.0540 1.1009 1.0982 1.0986 1.0978 1.0917 1.0985 1.1013 1.0948 1.0914 1.0919 1.0879 1.0912 1.0959 1.0916 1.0921 1.1179 1.0641
irintensity: 0.1166 0.0486 0.0307 0.2947 0.2546 3.3467 0.2174 0.6232 0.5224 2.3606 0.0310 0.3156 0.4660 0.8682 5.8245 0.5653 2.6488 0.9500 1.7673 0.0112 0.6850 6.9847 9.2644 1.4846 7.5412 13.5682 2.0986 1.9541 0.5802 1.8515 4.3088 4.8428 0.7881 1.8368 24.9365 3.8367 12.1838 6.7902 2.7195 9.5689 3.6377 3.5759 12.6016 9.4947 8.8406 122.0553 12.1403 18.2837 3.8216 0.9485 0.2220 55.9572 2.1295 6.6963 11.2975 9.3547 14.3438 4.8924 4.9738 0.2928 0.5649 6.5777 28.0545 37.0583 2.3330 14.3157 14.0367 13.5596 0.1753 30.4335 2.1996 12.1015 77.7965 115.9454 22.5697 0.1738 80.0497 60.0131 19.7007 151.7765 530.5739 599.7165 11.1134 2.8036 13.8934 23.9271 489.1934 8.1858 3.0733 0.9198 18.1539 14.5163 23.9148 9.8062 2.2729 8.1637 1.5825 5.3691 104.2654 2.0394 11.9102 70.3343 3.6965 1.4429 4.9732 17.9606 0.4906 1.3296 8.1870 6.8187 0.7043 0.9978 3.9120 202.8236 31.7099 127.3688 8.5876 20.2280 15.2619 14.6176 10.9811 14.2141 12.8559 19.2235 10.4804 7.1607 10.0866 2.6656 6.7611 7.9465 9.3142 1.2100 82.4953 501.8665 160.8969 197.0033 13.7388 15.7668 73.4281 38.5651 4.0448 21.7715 28.8981 46.2487 13.9748 24.6423 8.4780 26.7464 31.9374 20.6668 29.4360 26.6486 16.2903 12.4454 25.8461 0.3759 4.1923 0.0043 17.6643 27.7429 7.5782 6.2883 6.1663 16.3170 79.2831
temp: 298.150 k
press: 1.00000 atm
elementType: 8 8 8 8 8 8 6 6 6 6 6 6 6 6 6 6 6 6 6 6 6 6 6 6 6 6 6 6 6 1 1 1 1 1 1 1 1 1 1 1 1 1 1 1 1 1 1 1 1 1 1 1 1 1 1 1 1
symmnumber: 1
zpe: 1213089.5 jmol-1
zpe.correction: 0.462041 hartree
zpe.thermalcorrener: 0.490815 hartree
zpe.thermalcorrenthalpy: 0.491759 hartree
zpe.thermalcorrgfe: 0.401305 hartree
zpe.sumelectzpe: -1342.328708 hartree
zpe.sumelectthermal: -1342.299934 hartree
zpe.sumelectthermalent: -1342.298990 hartree
zpe.sumelectthermalfe: -1342.389444 hartree
dipole: 0.3192 2.1447 1.3826
dipole: 2.5716
quadrupole: -162.8056 -183.2801 -171.2557
quadrupole: 15.1467 3.1363 5.0407
quadrupole: 9.6416 -10.8330 1.1914 15.1467 3.1363 5.0407
hfenergy: -1342.7907497 hartree
pointgroup: C01 [X(C23H28O6)]
dipole: 0.0887138 0.8704494 0.5080346 debye
polarizability: 563.833724|-9.4892474|251.913266|-20.272296|-12.1532692|195.4580871 unknown
InChI: InChI=1S/C23H28O6/c1-15-10-11-21(2)16(12-15)28-18-13-17(22(21,3)23(18)14-27-23)29-20(26)9-7-5-4-6-8-19(24)25/h4-9,12,16-18,24H,10-11,13-14H2,1-3H3
charge 0 multiplicity 1
57 atoms
O  4.444971 -2.83664 0.148438
O  4.029905 0.430969 -1.761902
O  0.462363 -0.818818 -0.566862
O  -0.600763 -2.522504 0.660604
O  -10.388967 -0.338832 0.814196
O  -9.329434 1.325352 -0.428927
C  2.81135 -0.829592 0.564179
C  4.086743 -1.379279 -0.11317
C  2.896108 0.767244 0.489162
C  3.897463 -1.031634 -1.588947
C  1.778711 -1.498598 -0.442931
C  5.383114 -1.709368 0.525189
C  2.45843 -1.540566 -1.843865
C  2.98797 1.213487 -1.006854
C  2.579258 -1.356465 1.993472
C  4.1878 1.296435 1.189625
C  1.647904 1.413535 1.148952
C  3.37935 2.661076 -1.189721
C  4.279806 2.838991 1.148201
C  3.975241 3.416127 -0.226575
C  -0.65952 -1.45266 0.002457
C  4.349335 4.866706 -0.450938
C  -1.876018 -0.673456 -0.29912
C  -3.106917 -1.08119 0.156898
C  -4.342045 -0.375561 -0.103584
C  -5.571008 -0.800167 0.364657
C  -6.806255 -0.095871 0.101292
C  -8.036683 -0.504462 0.558276
C  -9.252436 0.267077 0.246859
H  4.659842 -1.467872 -2.252488
H  1.579751 -2.516863 -0.063679
H  6.303783 -1.659954 -0.07083
H  5.508953 -1.570154 1.606187
H  1.926823 -0.908451 -2.574504
H  2.478412 -2.572264 -2.232704
H  2.006413 1.03165 -1.492298
H  2.802326 -2.437499 2.030517
H  3.217733 -0.849379 2.738425
H  1.528003 -1.218699 2.298164
H  5.07139 0.891175 0.664962
H  4.232012 0.953098 2.240273
H  0.716965 1.015717 0.719578
H  1.638332 1.221538 2.236919
H  1.647504 2.506225 0.996559
H  3.186701 3.091076 -2.181044
H  5.298118 3.152598 1.456685
H  3.594351 3.296501 1.892764
H  4.049311 5.219707 -1.45263
H  5.443152 5.011976 -0.349591
H  3.872855 5.524156 0.303631
H  -1.751256 0.233337 -0.90104
H  -3.149068 -2.003591 0.754358
H  -4.289855 0.542715 -0.706952
H  -5.623651 -1.718171 0.968117
H  -6.764492 0.822878 -0.50189
H  -8.162244 -1.408036 1.164044
H  -11.191535 0.203347 0.585406
