program: Gaussian 09
title: 000197611
version: EM64L-G09RevD.01
frameworkgroup: C1[X(C11H12FIN4O4)]
method: RPBEPBE
basis: SDD
operation: Freq
keyword: #p
keyword: freq=noraman
keyword: PBEPBE/SDD
title: #p freq=noraman PBEPBE/SDD
converged: YES YES NO NO
title: Mulliken charges:
elementType: I F O O O O N N N N C C C C C C C C C C C H H H H H H H H H H H H
charge: 0.132321 -0.231785 -0.282003 -0.428862 -0.433579 -0.215515 -0.179590 -0.025855 0.038619 0.025540 -0.054494 -0.159385 -0.110292 -0.057757 -0.341182 0.162795 -0.198875 -0.099951 0.180083 -0.457357 -0.502908 0.248412 0.310714 0.268702 0.246309 0.206365 0.235620 0.353692 0.278276 0.352130 0.248981 0.242201 0.248632
chargesum: 0.00000
title: Mulliken charges with hydrogens summed into heavy atoms:
elementType: I F O O O O N N N N C C C C C C C C C C C
charge: 0.132321 -0.231785 -0.282003 -0.075170 -0.081449 -0.215515 -0.179590 -0.025855 0.038619 0.025540 0.193918 0.151330 0.158409 0.188552 0.100803 0.162795 0.079401 -0.099951 0.180083 -0.457357 0.236906
polarizability: 2.19788631e+02 -3.88076114e+00 2.26799897e+02 1.07985998e+01 2.13929616e+00 1.07241450e+02
1716.lowfreq: -9.0361 -5.6201 -5.2622 -0.0005 0.0001 0.0006 13.8045 25.9018 49.7045
frequency: 13.4621 25.8442 49.6978 61.7836 72.4324 90.3145 98.7637 112.5128 123.5148 129.4394 165.4795 173.0342 195.2633 227.2674 236.1867 250.8965 266.6852 298.2276 307.5037 317.6506 366.1447 372.9226 398.9658 424.7032 431.2405 497.6449 504.2509 539.1764 547.7119 624.0325 644.9959 656.4812 662.2197 678.0681 707.0536 730.3986 786.3384 792.5744 814.0134 830.3954 851.7354 859.9825 892.9813 914.5460 961.0274 972.0708 1014.3086 1018.8731 1027.8862 1047.1145 1085.2525 1106.7778 1109.9192 1111.5307 1150.7205 1160.0988 1183.4496 1195.2697 1207.2652 1225.8905 1252.2353 1260.7343 1263.6644 1283.5864 1293.3251 1294.8679 1316.9513 1325.8084 1337.8786 1350.6902 1372.9276 1376.5893 1386.3781 1391.7972 1436.3169 1449.1169 1451.1768 1455.8721 1459.6145 1524.7474 1561.3668 2968.8908 2998.6901 3012.0188 3019.7298 3079.3927 3087.3007 3113.7424 3118.8678 3157.9423 3229.8604 3532.3197 3557.4280
redmass: 7.8646 6.0705 7.7914 6.9421 6.7996 8.0006 4.6163 4.5220 1.2663 3.1706 5.2563 4.5339 5.4789 9.6010 10.9371 6.2491 5.8122 8.0011 5.7215 5.6023 3.2346 3.7315 2.9254 1.1711 1.8000 9.9278 4.0545 5.3726 5.5249 6.3455 5.5012 8.1759 7.9976 7.3085 5.9959 9.2263 5.7472 4.0903 4.5513 1.7259 6.7673 4.0068 8.3175 5.1562 4.4688 3.2904 5.2097 2.3601 3.4438 3.4139 4.9305 5.3023 2.1659 1.2523 1.6269 4.2584 1.2184 1.7204 1.4387 1.5601 2.6431 1.4535 1.4754 1.3521 3.9474 1.3638 8.0777 3.5904 1.2444 1.4023 1.9545 1.2093 1.3822 4.2170 1.4043 4.4062 1.0526 1.0840 1.0577 6.7413 9.9520 1.0686 1.0839 1.0289 1.0852 1.0869 1.0963 1.0900 1.1050 1.1056 1.0990 1.0653 1.0659
irintensity: 0.1544 0.0516 0.5290 3.5070 0.2292 0.1603 2.8956 5.0904 0.5118 2.1363 1.3712 2.8438 1.7290 0.5225 0.3698 16.1710 5.2988 4.4898 1.2521 0.5267 30.4375 12.0478 50.2864 101.1918 111.6973 1.5964 18.3471 10.7147 5.4433 15.9902 2.5375 4.1928 1.1135 23.9237 35.2729 39.3845 10.6971 36.1280 82.9844 15.9986 50.8495 37.2962 3.4593 118.6164 33.5433 139.9151 12.2664 7.2724 99.5340 147.9872 11.2035 112.2298 13.2753 0.0535 6.2585 77.4596 11.1438 52.2691 123.1526 13.2277 197.5687 36.3499 39.8471 50.5358 86.1611 10.4853 144.5655 232.1928 10.2471 15.0045 12.1952 18.9406 30.2580 25.6551 10.5041 75.1519 15.7947 5.4823 35.4920 213.0243 314.2795 30.1680 52.7307 36.0131 21.5153 0.3516 17.1098 12.6184 20.3703 17.2176 0.5943 20.2944 9.8206
temp: 298.150 k
press: 1.00000 atm
elementType: 53 9 8 8 8 8 7 7 7 7 6 6 6 6 6 6 6 6 6 6 6 1 1 1 1 1 1 1 1 1 1 1 1
symmnumber: 1
zpe: 616338.9 jmol-1
zpe.correction: 0.234751 hartree
zpe.thermalcorrener: 0.254802 hartree
zpe.thermalcorrenthalpy: 0.255746 hartree
zpe.thermalcorrgfe: 0.182792 hartree
zpe.sumelectzpe: -1056.010186 hartree
zpe.sumelectthermal: -1055.990136 hartree
zpe.sumelectthermalent: -1055.989191 hartree
zpe.sumelectthermalfe: -1056.062146 hartree
dipole: 1.2018 2.0492 -1.5658
dipole: 2.8452
quadrupole: -125.2711 -143.5635 -143.4316
quadrupole: -7.4533 9.8618 0.0677
quadrupole: 12.1510 -6.1415 -6.0095 -7.4533 9.8618 0.0677
hfenergy: -1056.2449373 hartree
pointgroup: C01 [X(C11H12F1I1N4O4)]
dipole: -0.7433737 -0.2676141 0.7929717 debye
polarizability: 211.320773|-27.4100506|124.3010637|10.5617857|32.1769848|218.2081418 unknown
InChI: InChI=1S/C11H12FIN4O4/c1-20-9-6-8(15-11(13)16-9)17(3-14-6)10-5(12)7(19)4(2-18)21-10/h3-5,7,10,18-19H,2H2,1H3
charge 0 multiplicity 1
33 atoms
I  -1.646407 -0.781395 -3.570284
F  3.046592 -2.282351 1.331835
O  2.526478 0.811428 0.543417
O  3.485238 -2.227824 -1.348224
O  4.158422 2.336104 -1.329001
O  -4.022239 1.500296 0.652482
N  0.386986 0.19335 1.42987
N  -1.471835 1.176668 2.369906
N  -0.496894 -0.256042 -0.844754
N  -2.804433 0.478281 -1.097806
C  1.786032 -0.211381 1.302833
C  2.63221 -1.192807 -0.799491
C  2.009848 -1.555995 0.569309
C  3.365348 0.141393 -0.504296
C  3.457728 1.101853 -1.687023
C  -0.591707 0.212981 0.432512
C  -0.202095 0.797187 2.563088
C  -1.737513 0.818666 1.034581
C  -2.874851 0.935395 0.185596
C  -1.649094 -0.08166 -1.533872
C  -5.168345 1.596636 -0.289265
H  2.192798 -0.285903 2.329445
H  1.818214 -1.039983 -1.525795
H  1.133077 -2.217499 0.524533
H  4.372065 -0.047234 -0.079193
H  2.436005 1.308984 -2.070077
H  4.059272 0.641012 -2.488252
H  4.063101 -2.580047 -0.621231
H  0.352689 0.926929 3.490643
H  3.663658 2.762071 -0.582837
H  -4.892576 2.211042 -1.161736
H  -5.959599 2.073205 0.305045
H  -5.467173 0.591835 -0.629459
